{"text_format":"1","workbook":"xlsx","n_sheets":41,"sheets":["Picture","Sheet3","Wire","Powder Core Detail","Toroid Design","Curve","Sheet2","Welcome","Sheet1","MPP CF","HF CF","XF CF","79 CF","75 CF","PN_75","LI_75","Kool Mu CF Constants","All Material CL CF","E Core Design","CL Sum","LI_79","PN_79","LI_Xflux_E","PN_XFlux_E","E Core Detail","Shape Core Weight","Wire Resistivity","Powder Core Toroid OD","LI_KM_E","LI_MPP","PN_MPP","LI_HF","PN_HF","LI_KM","PN_KM","LI_XF","PN_XF","Wire Table","Surface Area","PN_KM_E","Curve Fit Equations"],"not_rendered":{"charts":3,"images":9,"macros":1,"external_links":1,"defined_names":4,"comments":0,"pivot_tables":0},"unopened":[],"bounds":{"document_bytes":16777216,"sheet_cells":100000,"rows_first":2000,"rows_last":500,"rows_between":2000,"halvings":0,"cell_chars":16384,"cell_head_chars":4096},"cells_cut":0,"cells_raw":0,"read":"whole","date_system":"1900"}

{"sheet":"Picture","index":0,"n_rows":0,"n_cols":0,"rows_kept":0,"cut":false,"hidden":true,"merged":[]}

{"sheet":"Sheet3","index":1,"n_rows":0,"n_cols":0,"rows_kept":0,"cut":false,"hidden":true,"merged":[]}

{"sheet":"Wire","index":2,"n_rows":47,"n_cols":16,"rows_kept":47,"cut":false,"hidden":true,"merged":[[1,5,1,9]]}
[]
["AWG\nWire Size","Cir Mils","Wire\nO.D. (cm)\nHeavy Build","Wire Area    sq. cm\n(x0.001)",null,"Current Capacity, Amps\n(listed by columns of amps/sq.cm.)",null,null,null,null,"Copper info","Copper info","Bare Wire OD (Inches)","Bare Wire Radius (mm)","Aluminum info","Aluminum info"]
[null,null,null,null,null,200,400,500,600,800,"Feet per Pound","$/pound",null,null,"Feet per Pound","$/pound"]
[6,26240,0.42099999999999999,139.19999999999999,{"$f":"D4*0.001","v":0.13919999999999999},26.596062162869462,53.192124325738924,66.490155407173646,79.788186488608375,106.384248651478,12.5,10.06,0.16200000000000001,{"$f":"M4*25.4*0.5","v":2.0573999999999999}]
[7,20820,0.376,111,{"$f":"D5*0.001","v":0.111},21.101822832865714,42.203645665731429,52.754557082164283,63.305468498597136,84.407291331462858,15.75,10.15,0.14430000000000001,{"$f":"M5*25.4*0.5","v":1.8326100000000001}]
[8,16510,0.33600000000000002,88.7,8.8700000000000001E-2,16.733761143455315,33.467522286910629,41.834402858638285,50.20128343036594,66.935044573821258,19.850000000000001,10.27,0.1285,{"$f":"M6*25.4*0.5","v":1.63195},65.8]
[9,13090,0.29899999999999999,70.2,7.0199999999999999E-2,13.262926387282855,26.52585277456571,33.157315968207136,39.788779161848566,53.05170554913142,25,10.31,0.1144,1.4528799999999999,83]
[10,10380,0.26700000000000002,56,5.6000000000000001E-2,10.522905694063136,21.045811388126271,26.307264235157838,31.568717082189405,42.091622776252542,31.5,7.57,0.1019,1.29413,104]
[11,8226,0.23799999999999999,44.5,4.4499999999999998E-2,8.3368480194415486,16.673696038883097,20.842120048603871,25.010544058324644,33.347392077766195,39,7.58,9.0700000000000003E-2,1.1518900000000001,132]
[12,6529,0.21299999999999999,35.6,3.56E-2,6.6162214326701747,13.232442865340349,16.540553581675436,19.848664298010522,26.464885730680699,49.9,7.59,8.0799999999999997E-2,1.02616,166]
[13,5184,0.19020000000000001,28.4,2.8399999999999998E-2,5.2535431432828554,10.507086286565711,13.133857858207138,15.760629429848565,21.014172573131422,62.9,7.6,7.1999999999999995E-2,{"$f":"M11*25.4*0.5","v":0.91439999999999988},210]
[14,4109,0.17150000000000001,23.1,2.3100000000000002E-2,4.1639295143811799,8.3278590287623597,10.40982378595295,12.49178854314354,16.655718057524719,79.180000000000007,7.94,6.4100000000000004E-2,0.81406999999999996,264]
[15,3260,0.15290000000000001,18.399999999999999,1.84E-2,3.3041482638485449,6.6082965276970898,8.260370659621362,9.9124447915456351,13.21659305539418,99.7,7.98,5.7099999999999998E-2,0.72516999999999998,333]
[16,2581,0.13689999999999999,14.72,1.472E-2,2.6152591777163332,5.2305183554326664,6.5381479442908335,7.8457775331489996,10.461036710865333,125.6,8.08,5.0799999999999998E-2,0.64515999999999996,421]
[17,2052,0.12239999999999999,11.77,1.1769999999999999E-2,2.0796187015623682,4.1592374031247363,5.19904675390592,6.2388561046871036,8.3184748062494727,157.69999999999999,8.19,4.53E-2,0.57530999999999999,529]
[18,1624,0.1095,9.42,9.4199999999999996E-3,1.6458770994549103,3.2917541989098207,4.1146927486372755,4.9376312983647308,6.5835083978196414,199.2,8.3000000000000007,4.0300000000000002E-2,0.51180999999999999,669]
[19,1289,9.8000000000000004E-2,7.54,7.5399999999999998E-3,1.3060993322712922,2.6121986645425843,3.2652483306782303,3.9182979968138762,5.2243973290851686,250.6,8.3800000000000008,3.5900000000000001E-2,0.45593,843]
[20,1024,8.7900000000000006E-2,6.07,6.0700000000000007E-3,1.0377369171916757,2.0754738343833514,2.5943422929791891,3.1132107515750267,4.1509476687667028,314.5,8.27,3.2000000000000001E-2,0.40639999999999998,1060]
[21,812.3,7.85E-2,4.84,4.8399999999999997E-3,0.82314629979388532,1.6462925995877706,2.0578657494847135,2.4694388993816561,3.2925851991755413,395.3,8.3699999999999992,2.8500000000000001E-2,0.36194999999999999,1340]
[22,640.1,7.0099999999999996E-2,3.86,3.8600000000000001E-3,0.64867678059103473,1.2973535611820695,1.6216919514775867,1.9460303417731042,2.5947071223641389,502.5,8.5299999999999994,2.53E-2,0.32130999999999998,1700]
[23,510.8,6.3200000000000006E-2,3.14,3.14E-3,0.51761182404767581,1.0352236480953516,1.2940295601191893,1.5528354721430273,2.0704472961907032,625,8.8000000000000007,2.2599999999999999E-2,0.28701999999999994,2130]
[24,404,5.6599999999999998E-2,2.52,2.5200000000000001E-3,0.40942977726036012,0.81885955452072023,1.0235744431509002,1.2282893317810804,1.6377191090414405,790.5,9.01,2.01E-2,0.25527,2690]
[25,320.39999999999998,5.0500000000000003E-2,2,2E-3,0.32470828675525848,0.64941657351051696,0.81177071688814617,0.97412486026577538,1.2988331470210339,992.1,9.32,1.7899999999999999E-2,0.22732999999999998,3390]
[26,252.8,4.5199999999999997E-2,1.6,1.6000000000000001E-3,0.25620143558127684,0.51240287116255367,0.64050358895319215,0.76860430674383062,1.0248057423251073,1254,9.06,1.5900000000000001E-2,0.20193,4300]
[27,201.6,4.0899999999999999E-2,1.31,1.3100000000000002E-3,0.20434499217043892,0.40868998434087783,0.51086248042609728,0.61303497651131678,0.81737996868175566,1571,9,1.4200000000000001E-2,0.18034,5390]
[28,158.80000000000001,3.6600000000000001E-2,1.05,1.0500000000000002E-3,0.16088975876303743,0.32177951752607487,0.40222439690759398,0.48266927628911233,0.64355903505214973,1987,9,1.26E-2,0.16002,6845]
[29,127.7,3.3000000000000002E-2,0.85499999999999998,8.5499999999999997E-4,0.12940295601191895,0.2588059120238379,0.32350739002979734,0.38820886803575683,0.51761182404767581,2463,9,1.1299999999999999E-2,0.14350999999999997,8503]
[30,100,2.9499999999999998E-2,0.68300000000000005,6.8300000000000001E-4,0.10134149581949956,0.20268299163899911,0.2533537395487489,0.30402448745849869,0.40536598327799822,3136,9,0.01,0.127,10870]
[31,79.209999999999994,2.6700000000000002E-2,0.56000000000000005,5.6000000000000006E-4,8.02725988386256E-2,0.1605451976772512,0.20068149709656399,0.24081779651587679,0.3210903953545024,3948,9,8.8999999999999999E-3,0.11302999999999999,13717]
[32,64,2.41E-2,0.45600000000000002,4.5600000000000003E-4,6.4858557324479732E-2,0.12971711464895946,0.16214639331119932,0.19457567197343917,0.25943422929791893,4873,9,8.0000000000000002E-3,0.1016,16978]
[33,50.41,2.1600000000000001E-2,0.36599999999999999,3.6600000000000001E-4,5.1086248042609729E-2,0.10217249608521946,0.12771562010652432,0.15325874412782919,0.20434499217043892,6161,9,7.1000000000000004E-3,9.017E-2,21552]
[34,39.69,1.9050000000000001E-2,0.28499999999999998,2.8499999999999999E-4,4.0222439690759358E-2,8.0444879381518716E-2,0.1005560992268984,0.12066731907227808,0.16088975876303743,7837,9,6.3E-3,8.0009999999999998E-2,27397]
[35,31.36,1.702E-2,0.22800000000000001,2.2800000000000001E-4,3.178069308899506E-2,6.356138617799012E-2,7.945173272248765E-2,9.534207926698518E-2,0.12712277235598024,9891,9,5.5999999999999999E-3,7.1119999999999989E-2,34602]
[36,25,1.524E-2,0.182,1.8200000000000001E-4,2.5335373954874889E-2,5.0670747909749778E-2,6.3338434887187225E-2,7.6006121864624673E-2,0.10134149581949956,12380,9,5.0000000000000001E-3,6.3500000000000001E-2,43478]
[37,20.25,1.397E-2,0.153,1.5300000000000001E-4,2.0521652903448654E-2,4.1043305806897308E-2,5.1304132258621633E-2,6.1564958710345959E-2,8.2086611613794616E-2,15290,9,4.4999999999999997E-3,5.7149999999999992E-2,53763]
[38,16,1.2449999999999999E-2,0.122,1.22E-4,1.6214639331119933E-2,3.2429278662239866E-2,4.0536598327799829E-2,4.8643917993359792E-2,6.4858557324479732E-2,19360,9,4.0000000000000001E-3,5.0799999999999998E-2,68027]
[39,12.25,1.0919999999999999E-2,9.4E-2,9.4000000000000008E-5,1.2414333237888694E-2,2.4828666475777389E-2,3.103583309472174E-2,3.7242999713666083E-2,4.9657332951554778E-2,25270,9,3.5000000000000001E-3,4.4449999999999996E-2,88496]
[40,9.61,9.6500000000000006E-3,7.2999999999999995E-2,7.2999999999999999E-5,9.7389177482539047E-3,1.9477835496507809E-2,2.4347294370634761E-2,2.9216753244761712E-2,3.8955670993015619E-2,31940,9,3.0999999999999999E-3,3.9369999999999995E-2,113636]
[41,7.84,8.6400000000000001E-3,5.8999999999999997E-2,5.8999999999999998E-5,7.945173272248765E-3,1.589034654449753E-2,1.9862933180621913E-2,2.3835519816746295E-2,3.178069308899506E-2,39340,9,2.8E-3,3.5559999999999994E-2,138889]
[42,6.25,7.62E-3,4.5999999999999999E-2,4.6E-5,6.3338434887187222E-3,1.2667686977437444E-2,1.5834608721796806E-2,1.9001530466156168E-2,2.5335373954874889E-2,49600,9,2.5000000000000001E-3,3.175E-2,172414]
[43,4.84,6.8599999999999998E-3,3.6999999999999998E-2,3.6999999999999998E-5,4.904928397663778E-3,9.809856795327556E-3,1.2262320994159446E-2,1.4714785192991334E-2,1.9619713590655112E-2,63170,9,2.2000000000000001E-3,2.794E-2,22222]
[44,4,6.3499999999999997E-3,3.2000000000000001E-2,3.1999999999999999E-5,4.0536598327799832E-3,8.1073196655599665E-3,1.0134149581949957E-2,1.2160979498339948E-2,1.6214639331119933E-2,76160,9,2E-3,2.5399999999999999E-2,270270]
[45,3.1,5.4599999999999996E-3,2.3E-2,2.3E-5,3.1391541745048185E-3,6.278308349009637E-3,7.8478854362620462E-3,9.4174625235144555E-3,1.2556616698019274E-2,99110,9,1.7600000000000001E-3,2.2352E-2]
[46,2.4700000000000002,4.9800000000000001E-3,1.9E-2,1.9000000000000001E-5,2.497966530454844E-3,4.995933060909688E-3,6.24491632613711E-3,7.493899591364532E-3,9.9918661218193761E-3,123800,9,1.57E-3,1.9938999999999998E-2]
[47,1.96,4.5199999999999997E-3,1.6E-2,1.5999999999999999E-5,1.9862933180621913E-3,3.9725866361243825E-3,4.9657332951554781E-3,5.9588799541865738E-3,7.945173272248765E-3,154600,9,1.4E-3,1.7779999999999997E-2]
[48,1.54,3.9399999999999999E-3,1.2E-2,1.2E-5,1.5582268397206253E-3,3.1164536794412506E-3,3.895567099301563E-3,4.6746805191618754E-3,6.2329073588825012E-3,196600,9,1.24E-3,1.5747999999999998E-2]
[49,1.23,3.5300000000000002E-3,0.01,1.0000000000000001E-5,1.24862856999205E-3,2.4972571399841078E-3,3.1215714249801349E-3,3.7458857099761616E-3,4.9945142799682155E-3,247500,9,1.1100000000000001E-3,1.4097E-2]

{"sheet":"Powder Core Detail","index":3,"n_rows":1138,"n_cols":22,"rows_kept":1138,"cut":false,"hidden":true,"merged":[]}
["Part #","Sales Part Number","Base Part Number","Perm","Material","AL [nH/T2]","Shape","Le [cm]","Le [mm]","ID min [inches]","ID min [mm]","OD max [inches]","OD max [mm]","HT max [inches]","HT max [mm]","Ae [cm2]","Ae [mm2]","Ve [cm3]","Ve [mm3]","WA (cm2)","Base Part Number","Unfinished OD"]
[4741,"00K4741B026",4741,26,"Kool Mu",0,"Block",0,0,1.6339999999999999,41.5,1.8939999999999999,48.11,1.099,27.91,0,0,53.6,53600]
[4741,"00K4741B02603",4741,26,"Kool Mu",0,"Block",0,0,1.6339999999999999,41.5,1.8939999999999999,48.11,0.80600000000000005,20.5,0,0,39.9,39900]
[4741,"00K4741B060",4741,60,"Kool Mu",0,"Block",0,0,1.6339999999999999,41.5,1.8939999999999999,48.11,1.099,27.91,0,0,53.6,53600]
[5528,"00K5528B026",5528,26,"Kool Mu",0,"Block",0,0,1.101,27.97,2.1850000000000001,55.5,0.82699999999999996,21,0,0,31.2,31200]
[5528,"00K5528B040",5528,40,"Kool Mu",0,"Block",0,0,1.101,27.97,2.1850000000000001,55.5,0.82699999999999996,21,0,0,31.2,31200]
[5528,"00K5528B060",5528,60,"Kool Mu",0,"Block",0,0,1.101,27.97,2.1850000000000001,55.5,0.82699999999999996,21,0,0,31.2,31200]
[6030,"00K6030B090",6030,90,"Kool Mu",0,"Block",0,0,1.1910000000000001,30.25,2.3719999999999999,60.25,0.60099999999999998,15.25,0,0,27,27000]
[6030,"00K6030B060",6030,60,"Kool Mu",0,"Block",0,0,1.1910000000000001,30.25,2.3719999999999999,60.25,0.59099999999999997,15.25,0,0,27,27000]
[6030,"00K6030B026",6030,26,"Kool Mu",0,"Block",0,0,1.1910000000000001,30.25,2.3719999999999999,60.25,0.59099999999999997,15.25,0,0,27,27000]
[8020,"00K8020E02601",8020,26,"Kool Mu",155,"E Core",18.5,185,1.5249999999999999,38.74,3.1970000000000001,81.209999999999994,1.2649999999999999,32.130000000000003,6.29,629,116,116000]
[8020,"00K8020E02602",8020,26,"Kool Mu",145,"E Core",18.5,185,1.5249999999999999,38.74,3.1970000000000001,81.209999999999994,1.1850000000000001,30.1,5.84,584,108,108000]
[8030,"00K8030E026",8030,26,"Kool Mu",0,"Block",0,0,1.2130000000000001,30.81,3.1890000000000001,81,1.3819999999999999,35.1,0,0,85.4,85400]
[8030,"00K8030E040",8030,40,"Kool Mu",0,"Block",0,0,1.2130000000000001,30.81,3.1890000000000001,81,1.3819999999999999,35.1,0,0,85.4,85400]
[8044,"00K8044E02601",8044,26,"Kool Mu",137,"E Core",20.8,208,1.78,45.21,3.1970000000000001,81.2,1.1850000000000001,30.1,5.84,584,121,121000]
[55098,"0055098A2",102,125,"MPP",232,"Toroid",24.3,243,2.1949999999999998,55.75,4.0549999999999997,103,0.70499999999999996,17.899999999999999,3.58,358,86.9,86900,24.7,{"$f":"C16*1","v":102},{"$f":"VLOOKUP(U16,'Powder Core Toroid OD'!$A$2:$B$36,2,FALSE)","v":101.6}]
[55099,"0055099A2",102,60,"MPP",111,"Toroid",24.3,243,2.1949999999999998,55.75,4.0549999999999997,103,0.70499999999999996,17.899999999999999,3.58,358,86.9,86900,24.7,{"$f":"C17*1","v":102},{"$f":"VLOOKUP(U17,'Powder Core Toroid OD'!$A$2:$B$36,2,FALSE)","v":101.6}]
[55101,"0055101A2",102,14,"MPP",26,"Toroid",24.3,243,2.1949999999999998,55.75,4.0549999999999997,103,0.70499999999999996,17.899999999999999,3.58,358,86.9,86900,24.7,102,{"$f":"VLOOKUP(U18,'Powder Core Toroid OD'!$A$2:$B$36,2,FALSE)","v":101.6}]
[55102,"0055102A2",102,26,"MPP",48,"Toroid",24.3,243,2.1949999999999998,55.75,4.0549999999999997,103,0.70499999999999996,17.899999999999999,3.58,358,86.9,86900,24.7,102,{"$f":"VLOOKUP(U19,'Powder Core Toroid OD'!$A$2:$B$36,2,FALSE)","v":101.6}]
[55164,"0055164A2",165,14,"MPP",42,"Toroid",41.2,412,3.9769999999999999,101,6.5549999999999997,166.5,1.3049999999999999,33.15,9.8699999999999992,987,407,407000,80.3,165,{"$f":"VLOOKUP(U20,'Powder Core Toroid OD'!$A$2:$B$36,2,FALSE)","v":165.1}]
[55165,"0055165A2",165,26,"MPP",78,"Toroid",41.2,412,3.9769999999999999,101,6.5549999999999997,166.5,1.3049999999999999,33.15,9.8699999999999992,987,407,407000,80.3,165,{"$f":"VLOOKUP(U21,'Powder Core Toroid OD'!$A$2:$B$36,2,FALSE)","v":165.1}]
[55167,"0055167A2",165,60,"MPP",180,"Toroid",41.2,412,3.9769999999999999,101,6.5549999999999997,166.5,1.3049999999999999,33.15,9.8699999999999992,987,407,407000,80.3,165,{"$f":"VLOOKUP(U22,'Powder Core Toroid OD'!$A$2:$B$36,2,FALSE)","v":165.1}]
[55195,"C055195A2",195,125,"MPP",287,"Toroid",12.5,125,1.0069999999999999,25.57,2.2850000000000001,58.04,0.63500000000000001,16.2,2.29,229,28.6,28600,5.14,195,{"$f":"VLOOKUP(U23,'Powder Core Toroid OD'!$A$2:$B$36,2,FALSE)","v":57.2}]
[55336,"0055336A2",337,14,"MPP",37,"Toroid",32.4,324,3.0390000000000001,77.19,5.274,134,1.0549999999999999,26.8,6.78,678,220,220000,47.1,337,{"$f":"VLOOKUP(U24,'Powder Core Toroid OD'!$A$2:$B$36,2,FALSE)","v":132.6}]
[55337,"0055337A2",337,26,"MPP",68,"Toroid",32.4,324,3.0390000000000001,77.19,5.274,134,1.0549999999999999,26.8,6.78,678,220,220000,47.1,337,{"$f":"VLOOKUP(U25,'Powder Core Toroid OD'!$A$2:$B$36,2,FALSE)","v":132.6}]
[55339,"0055339A2",337,60,"MPP",158,"Toroid",32.4,324,3.0390000000000001,77.19,5.274,134,1.0549999999999999,26.8,6.78,678,220,220000,47.1,337,{"$f":"VLOOKUP(U26,'Powder Core Toroid OD'!$A$2:$B$36,2,FALSE)","v":132.6}]
[55340,"0055340A2",337,125,"MPP",329,"Toroid",32.4,324,3.0390000000000001,77.19,5.274,134,1.0549999999999999,26.8,6.78,678,220,220000,47.1,337,{"$f":"VLOOKUP(U27,'Powder Core Toroid OD'!$A$2:$B$36,2,FALSE)","v":132.6}]
[55614,"0055614A2",620,14,"MPP",44,"Toroid",14.4,144,1.248,31.69,2.4769999999999999,62.91,1.02,25.91,3.6,360,51.8,51800,7.89,620,{"$f":"VLOOKUP(U28,'Powder Core Toroid OD'!$A$2:$B$36,2,FALSE)","v":62}]
[55615,"0055615A2",620,26,"MPP",82,"Toroid",14.4,144,1.248,31.69,2.4769999999999999,62.91,1.02,25.91,3.6,360,51.8,51800,7.89,620,{"$f":"VLOOKUP(U29,'Powder Core Toroid OD'!$A$2:$B$36,2,FALSE)","v":62}]
[55617,"C055617A2",620,60,"MPP",189,"Toroid",14.4,144,1.248,31.69,2.4769999999999999,62.91,1.02,25.91,3.6,360,51.8,51800,7.89,620,{"$f":"VLOOKUP(U30,'Powder Core Toroid OD'!$A$2:$B$36,2,FALSE)","v":62}]
[55620,"C055620A2",620,125,"MPP",394,"Toroid",14.4,144,1.248,31.69,2.4769999999999999,62.91,1.02,25.91,3.6,360,51.8,51800,7.89,620,{"$f":"VLOOKUP(U31,'Powder Core Toroid OD'!$A$2:$B$36,2,FALSE)","v":62}]
[55734,"0055734A2",740,14,"MPP",48,"Toroid",18.399999999999999,184,1.748,44.39,2.9529999999999998,75.010000000000005,1.4139999999999999,35.92,4.97,497,91.4,91400,15.5,740,{"$f":"VLOOKUP(U32,'Powder Core Toroid OD'!$A$2:$B$36,2,FALSE)","v":74.099999999999994}]
[55735,"0055735A2",740,26,"MPP",88,"Toroid",18.399999999999999,184,1.748,44.39,2.9529999999999998,75.010000000000005,1.4139999999999999,35.92,4.97,497,91.4,91400,15.5,740,{"$f":"VLOOKUP(U33,'Powder Core Toroid OD'!$A$2:$B$36,2,FALSE)","v":74.099999999999994}]
[55737,"C055737A2",740,60,"MPP",204,"Toroid",18.399999999999999,184,1.748,44.39,2.9529999999999998,75.010000000000005,1.4139999999999999,35.92,4.97,497,91.4,91400,15.5,740,{"$f":"VLOOKUP(U34,'Powder Core Toroid OD'!$A$2:$B$36,2,FALSE)","v":74.099999999999994}]
[55740,"C055740A2",740,125,"MPP",425,"Toroid",18.399999999999999,184,1.748,44.39,2.9529999999999998,75.010000000000005,1.4139999999999999,35.92,4.97,497,91.4,91400,15.5,740,{"$f":"VLOOKUP(U35,'Powder Core Toroid OD'!$A$2:$B$36,2,FALSE)","v":74.099999999999994}]
[58098,"0058098A2",102,125,"High Flux",232,"Toroid",24.3,243,2.1949999999999998,55.75,4.0549999999999997,103,0.70499999999999996,17.899999999999999,3.58,358,86.9,86900,24.7,102,{"$f":"VLOOKUP(U36,'Powder Core Toroid OD'!$A$2:$B$36,2,FALSE)","v":101.6}]
[58099,"0058099A2",102,60,"High Flux",111,"Toroid",24.3,243,2.1949999999999998,55.75,4.0549999999999997,103,0.70499999999999996,17.899999999999999,3.58,358,86.9,86900,24.7,102,{"$f":"VLOOKUP(U37,'Powder Core Toroid OD'!$A$2:$B$36,2,FALSE)","v":101.6}]
[58101,"0058101A2",102,14,"High Flux",26,"Toroid",24.3,243,2.1949999999999998,55.75,4.0549999999999997,103,0.70499999999999996,17.899999999999999,3.58,358,86.9,86900,24.7,102,{"$f":"VLOOKUP(U38,'Powder Core Toroid OD'!$A$2:$B$36,2,FALSE)","v":101.6}]
[58102,"0058102A2",102,26,"High Flux",48,"Toroid",24.3,243,2.1949999999999998,55.75,4.0549999999999997,103,0.70499999999999996,17.899999999999999,3.58,358,86.9,86900,24.7,102,{"$f":"VLOOKUP(U39,'Powder Core Toroid OD'!$A$2:$B$36,2,FALSE)","v":101.6}]
[58164,"0058164A2",165,14,"High Flux",42,"Toroid",41.2,412,3.9769999999999999,101,6.5549999999999997,166.5,1.3049999999999999,33.15,9.8699999999999992,987,407,407000,80.3,165,{"$f":"VLOOKUP(U40,'Powder Core Toroid OD'!$A$2:$B$36,2,FALSE)","v":165.1}]
[58165,"0058165A2",165,26,"High Flux",78,"Toroid",41.2,412,3.9769999999999999,101,6.5549999999999997,166.5,1.3049999999999999,33.15,9.8699999999999992,987,407,407000,80.3,165,{"$f":"VLOOKUP(U41,'Powder Core Toroid OD'!$A$2:$B$36,2,FALSE)","v":165.1}]
[58167,"0058167A2",165,60,"High Flux",180,"Toroid",41.2,412,3.9769999999999999,101,6.5549999999999997,166.5,1.3049999999999999,33.15,9.8699999999999992,987,407,407000,80.3,165,{"$f":"VLOOKUP(U42,'Powder Core Toroid OD'!$A$2:$B$36,2,FALSE)","v":165.1}]
[58336,"0058336A2",337,14,"High Flux",37,"Toroid",32.4,324,3.0390000000000001,77.19,5.274,134,1.0549999999999999,26.8,6.78,678,220,220000,47.1,337,{"$f":"VLOOKUP(U43,'Powder Core Toroid OD'!$A$2:$B$36,2,FALSE)","v":132.6}]
[58337,"0058337A2",337,26,"High Flux",68,"Toroid",32.4,324,3.0390000000000001,77.19,5.274,134,1.0549999999999999,26.8,6.78,678,220,220000,47.1,337,{"$f":"VLOOKUP(U44,'Powder Core Toroid OD'!$A$2:$B$36,2,FALSE)","v":132.6}]
[58339,"0058339A2",337,60,"High Flux",158,"Toroid",32.4,324,3.0390000000000001,77.19,5.274,134,1.0549999999999999,26.8,6.78,678,220,220000,47.1,337,{"$f":"VLOOKUP(U45,'Powder Core Toroid OD'!$A$2:$B$36,2,FALSE)","v":132.6}]
[58340,"0058340A2",337,125,"High Flux",329,"Toroid",32.4,324,3.0390000000000001,77.19,5.274,134,1.0549999999999999,26.8,6.78,678,220,220000,47.1,337,{"$f":"VLOOKUP(U46,'Powder Core Toroid OD'!$A$2:$B$36,2,FALSE)","v":132.6}]
[58587,"0058587A2",585,26,"High Flux",16,"Toroid",8.9499999999999993,89.5,0.88800000000000001,22.5,1.385,35.18,0.38500000000000001,9.7799999999999994,0.46400000000000002,46.4,4.1500000000000004,4150,3.99,585,{"$f":"VLOOKUP(U47,'Powder Core Toroid OD'!$A$2:$B$36,2,FALSE)","v":34.299999999999997}]
[58614,"0058614A2",620,14,"High Flux",44,"Toroid",14.4,144,1.248,31.69,2.4769999999999999,62.91,1.02,25.91,3.6,360,51.8,51800,7.89,620,{"$f":"VLOOKUP(U48,'Powder Core Toroid OD'!$A$2:$B$36,2,FALSE)","v":62}]
[58615,"0058615A2",620,26,"High Flux",82,"Toroid",14.4,144,1.248,31.69,2.4769999999999999,62.91,1.02,25.91,3.6,360,51.8,51800,7.89,620,{"$f":"VLOOKUP(U49,'Powder Core Toroid OD'!$A$2:$B$36,2,FALSE)","v":62}]
[58617,"C058617A2",620,60,"High Flux",189,"Toroid",14.4,144,1.248,31.69,2.4769999999999999,62.91,1.02,25.91,3.6,360,51.8,51800,7.89,620,{"$f":"VLOOKUP(U50,'Powder Core Toroid OD'!$A$2:$B$36,2,FALSE)","v":62}]
[58620,"C058620A2",620,125,"High Flux",394,"Toroid",14.4,144,1.248,31.69,2.4769999999999999,62.91,1.02,25.91,3.6,360,51.8,51800,7.89,620,{"$f":"VLOOKUP(U51,'Powder Core Toroid OD'!$A$2:$B$36,2,FALSE)","v":62}]
[58734,"0058734A2",740,14,"High Flux",48,"Toroid",18.399999999999999,184,1.748,44.39,2.9529999999999998,75.010000000000005,1.4139999999999999,35.92,4.97,497,91.4,91400,15.5,740,{"$f":"VLOOKUP(U52,'Powder Core Toroid OD'!$A$2:$B$36,2,FALSE)","v":74.099999999999994}]
[58735,"0058735A2",740,26,"High Flux",88,"Toroid",18.399999999999999,184,1.748,44.39,2.9529999999999998,75.010000000000005,1.4139999999999999,35.92,4.97,497,91.4,91400,15.5,740,{"$f":"VLOOKUP(U53,'Powder Core Toroid OD'!$A$2:$B$36,2,FALSE)","v":74.099999999999994}]
[58737,"C058737A2",740,60,"High Flux",204,"Toroid",18.399999999999999,184,1.748,44.39,2.9529999999999998,75.010000000000005,1.4139999999999999,35.92,4.97,497,91.4,91400,15.5,740,{"$f":"VLOOKUP(U54,'Powder Core Toroid OD'!$A$2:$B$36,2,FALSE)","v":74.099999999999994}]
[58740,"C058740A2",740,125,"High Flux",425,"Toroid",18.399999999999999,184,1.748,44.39,2.9529999999999998,75.010000000000005,1.4139999999999999,35.92,4.97,497,91.4,91400,15.5,740,{"$f":"VLOOKUP(U55,'Powder Core Toroid OD'!$A$2:$B$36,2,FALSE)","v":74.099999999999994}]
[77098,"0077098A7",102,125,"Kool Mu",232,"Toroid",24.3,243,2.1949999999999998,55.75,4.0549999999999997,103,0.70499999999999996,17.899999999999999,3.58,358,86.9,86900,24.7,102,{"$f":"VLOOKUP(U56,'Powder Core Toroid OD'!$A$2:$B$36,2,FALSE)","v":101.6}]
[77099,"0077099A7",102,60,"Kool Mu",111,"Toroid",24.3,243,2.1949999999999998,55.75,4.0549999999999997,103,0.70499999999999996,17.899999999999999,3.58,358,86.9,86900,24.7,102,{"$f":"VLOOKUP(U57,'Powder Core Toroid OD'!$A$2:$B$36,2,FALSE)","v":101.6}]
[77100,"0077100A7",102,40,"Kool Mu",74,"Toroid",24.3,243,2.1949999999999998,55.75,4.0549999999999997,103,0.70499999999999996,17.899999999999999,3.58,358,86.9,86900,24.7,102,{"$f":"VLOOKUP(U58,'Powder Core Toroid OD'!$A$2:$B$36,2,FALSE)","v":101.6}]
[77102,"0077102A7",102,26,"Kool Mu",48,"Toroid",24.3,243,2.1949999999999998,55.75,4.0549999999999997,103,0.70499999999999996,17.899999999999999,3.58,358,86.9,86900,24.7,102,{"$f":"VLOOKUP(U59,'Powder Core Toroid OD'!$A$2:$B$36,2,FALSE)","v":101.6}]
[77165,"0077165A7",165,26,"Kool Mu",78,"Toroid",41.2,412,3.9769999999999999,101,6.5549999999999997,166.5,1.3049999999999999,33.15,9.8699999999999992,987,407,407000,80.3,165,{"$f":"VLOOKUP(U60,'Powder Core Toroid OD'!$A$2:$B$36,2,FALSE)","v":165.1}]
[77337,"0077337A7",337,26,"Kool Mu",68,"Toroid",32.4,324,3.0390000000000001,77.19,5.274,134,1.0549999999999999,26.8,6.78,678,220,220000,47.1,337,{"$f":"VLOOKUP(U61,'Powder Core Toroid OD'!$A$2:$B$36,2,FALSE)","v":132.6}]
[77615,"0077615A7",620,26,"Kool Mu",82,"Toroid",14.4,144,1.248,31.69,2.4769999999999999,62.91,1.02,25.91,3.6,360,51.8,51800,7.89,620,{"$f":"VLOOKUP(U62,'Powder Core Toroid OD'!$A$2:$B$36,2,FALSE)","v":62}]
[77616,"0077616A7",620,40,"Kool Mu",126,"Toroid",14.4,144,1.248,31.69,2.4769999999999999,62.91,1.02,25.91,3.6,360,51.8,51800,7.89,620,{"$f":"VLOOKUP(U63,'Powder Core Toroid OD'!$A$2:$B$36,2,FALSE)","v":62}]
[77617,"0077617A7",620,60,"Kool Mu",189,"Toroid",14.4,144,1.248,31.69,2.4769999999999999,62.91,1.02,25.91,3.6,360,51.8,51800,7.89,620,{"$f":"VLOOKUP(U64,'Powder Core Toroid OD'!$A$2:$B$36,2,FALSE)","v":62}]
[77618,"0077618A7",620,75,"Kool Mu",237,"Toroid",14.4,144,1.248,31.69,2.4769999999999999,62.91,1.02,25.91,3.6,360,51.8,51800,7.89,620,{"$f":"VLOOKUP(U65,'Powder Core Toroid OD'!$A$2:$B$36,2,FALSE)","v":62}]
[77619,"0077619A7",620,90,"Kool Mu",284,"Toroid",14.4,144,1.248,31.69,2.4769999999999999,62.91,1.02,25.91,3.6,360,51.8,51800,7.89,620,{"$f":"VLOOKUP(U66,'Powder Core Toroid OD'!$A$2:$B$36,2,FALSE)","v":62}]
[77620,"0077620A7",620,125,"Kool Mu",394,"Toroid",14.4,144,1.248,31.69,2.4769999999999999,62.91,1.02,25.91,3.6,360,51.8,51800,7.89,620,{"$f":"VLOOKUP(U67,'Powder Core Toroid OD'!$A$2:$B$36,2,FALSE)","v":62}]
[77735,"0077735A7",740,26,"Kool Mu",88,"Toroid",18.399999999999999,184,1.748,44.39,2.9529999999999998,75.010000000000005,1.4139999999999999,35.92,4.97,497,91.4,91400,15.5,740,{"$f":"VLOOKUP(U68,'Powder Core Toroid OD'!$A$2:$B$36,2,FALSE)","v":74.099999999999994}]
[77736,"0077736A7",740,40,"Kool Mu",136,"Toroid",18.399999999999999,184,1.748,44.39,2.9529999999999998,75.010000000000005,1.4139999999999999,35.92,4.97,497,91.4,91400,15.5,740,{"$f":"VLOOKUP(U69,'Powder Core Toroid OD'!$A$2:$B$36,2,FALSE)","v":74.099999999999994}]
[77737,"0077737A7",740,60,"Kool Mu",204,"Toroid",18.399999999999999,184,1.748,44.39,2.9529999999999998,75.010000000000005,1.4139999999999999,35.92,4.97,497,91.4,91400,15.5,740,{"$f":"VLOOKUP(U70,'Powder Core Toroid OD'!$A$2:$B$36,2,FALSE)","v":74.099999999999994}]
[77738,"0077738A7",740,75,"Kool Mu",255,"Toroid",18.399999999999999,184,1.748,44.39,2.9529999999999998,75.010000000000005,1.4139999999999999,35.92,4.97,497,91.4,91400,15.5,740,{"$f":"VLOOKUP(U71,'Powder Core Toroid OD'!$A$2:$B$36,2,FALSE)","v":74.099999999999994}]
[77739,"0077739A7",740,90,"Kool Mu",306,"Toroid",18.399999999999999,184,1.748,44.39,2.9529999999999998,75.010000000000005,1.4139999999999999,35.92,4.97,497,91.4,91400,15.5,740,{"$f":"VLOOKUP(U72,'Powder Core Toroid OD'!$A$2:$B$36,2,FALSE)","v":74.099999999999994}]
[77740,"0077740A7",740,125,"Kool Mu",425,"Toroid",18.399999999999999,184,1.748,44.39,2.9529999999999998,75.010000000000005,1.4139999999999999,35.92,4.97,497,91.4,91400,15.5,740,{"$f":"VLOOKUP(U73,'Powder Core Toroid OD'!$A$2:$B$36,2,FALSE)","v":74.099999999999994}]
[301,"00M0301T125","0301",125,"MPP",8.4,"Thinz",0.70399999999999996,7.0399999999999991,6.7000000000000004E-2,1.7,0.125,3.18,3.5000000000000003E-2,0.89,4.0000000000000001E-3,0.4,2.8E-3,2.8]
[301,"00M0301T160","0301",160,"MPP",10.8,"Thinz",0.70399999999999996,7.0399999999999991,6.7000000000000004E-2,1.7,0.125,3.18,3.5000000000000003E-2,0.89,4.0000000000000001E-3,0.4,2.8E-3,2.8]
[301,"00M0301T200","0301",200,"MPP",13.5,"Thinz",0.70399999999999996,7.0399999999999991,6.7000000000000004E-2,1.7,0.125,3.18,3.5000000000000003E-2,0.89,4.0000000000000001E-3,0.4,2.8E-3,2.8]
[301,"00M0301T250","0301",250,"MPP",16.899999999999999,"Thinz",0.70399999999999996,7.0399999999999991,6.7000000000000004E-2,1.7,0.125,3.18,3.5000000000000003E-2,0.89,4.0000000000000001E-3,0.4,2.8E-3,2.8]
[302,"00M0302T125","0302",125,"MPP",11.6,"Thinz",0.80600000000000005,8.06,6.7000000000000004E-2,1.7,0.14499999999999999,3.69,3.5000000000000003E-2,0.89,6.0000000000000001E-3,0.6,4.7999999999999996E-3,4.8]
[302,"00M0302T160","0302",160,"MPP",14.8,"Thinz",0.80600000000000005,8.06,6.7000000000000004E-2,1.7,0.14499999999999999,3.69,3.5000000000000003E-2,0.89,6.0000000000000001E-3,0.6,4.7999999999999996E-3,4.8]
[302,"00M0302T200","0302",200,"MPP",18.7,"Thinz",0.80600000000000005,8.06,6.7000000000000004E-2,1.7,0.14499999999999999,3.69,3.5000000000000003E-2,0.89,6.0000000000000001E-3,0.6,4.7999999999999996E-3,4.8]
[302,"00M0302T250","0302",250,"MPP",23.4,"Thinz",0.80600000000000005,8.06,6.7000000000000004E-2,1.7,0.14499999999999999,3.69,3.5000000000000003E-2,0.89,6.0000000000000001E-3,0.6,4.7999999999999996E-3,4.8]
[402,"00M0402T125","0402",125,"MPP",9.6,"Thinz",0.94399999999999995,9.44,8.4000000000000005E-2,2.13,0.16,4.07,3.5000000000000003E-2,0.89,5.7999999999999996E-3,0.57999999999999996,5.4999999999999997E-3,5.5]
[402,"00M0402T160","0402",160,"MPP",12.3,"Thinz",0.94399999999999995,9.44,8.4000000000000005E-2,2.13,0.16,4.07,3.5000000000000003E-2,0.89,5.7999999999999996E-3,0.57999999999999996,5.4999999999999997E-3,5.5]
[402,"00M0402T200","0402",200,"MPP",15.4,"Thinz",0.94399999999999995,9.44,8.4000000000000005E-2,2.13,0.16,4.07,3.5000000000000003E-2,0.89,5.7999999999999996E-3,0.57999999999999996,5.4999999999999997E-3,5.5]
[402,"00M0402T250","0402",250,"MPP",19.3,"Thinz",0.94399999999999995,9.44,8.4000000000000005E-2,2.13,0.16,4.07,3.5000000000000003E-2,0.89,5.7999999999999996E-3,0.57999999999999996,5.4999999999999997E-3,5.5]
[502,"00M0502T125","0502",125,"MPP",11.7,"Thinz",1.06,10.6,8.8999999999999996E-2,2.2599999999999998,0.186,4.7300000000000004,3.5000000000000003E-2,0.89,7.9000000000000008E-3,0.79,8.3000000000000001E-3,8.3000000000000007]
[502,"00M0502T160","0502",160,"MPP",15,"Thinz",1.06,10.6,8.8999999999999996E-2,2.2599999999999998,0.186,4.7300000000000004,3.5000000000000003E-2,0.89,7.9000000000000008E-3,0.79,8.3000000000000001E-3,8.3000000000000007]
[502,"00M0502T200","0502",200,"MPP",18.7,"Thinz",1.06,10.6,8.8999999999999996E-2,2.2599999999999998,0.186,4.7300000000000004,3.5000000000000003E-2,0.89,7.9000000000000008E-3,0.79,8.3000000000000001E-3,8.3000000000000007]
[502,"00M0502T250","0502",250,"MPP",23.4,"Thinz",1.06,10.6,8.8999999999999996E-2,2.2599999999999998,0.186,4.7300000000000004,3.5000000000000003E-2,0.89,7.9000000000000008E-3,0.79,8.3000000000000001E-3,8.3000000000000007]
[603,"00M0603T125","0603",125,"MPP",14.9,"Thinz",1.36,13.6,0.105,2.67,0.255,6.48,3.5000000000000003E-2,0.89,1.2999999999999999E-2,1.3,1.77E-2,17.7]
[603,"00M0603T160","0603",160,"MPP",19.100000000000001,"Thinz",1.36,13.6,0.105,2.67,0.255,6.48,3.5000000000000003E-2,0.89,1.2999999999999999E-2,1.3,1.77E-2,17.7]
[603,"00M0603T200","0603",200,"MPP",24,"Thinz",1.36,13.6,0.105,2.67,0.255,6.48,3.5000000000000003E-2,0.89,1.2999999999999999E-2,1.3,1.77E-2,17.7]
[603,"00M0603T250","0603",250,"MPP",30,"Thinz",1.36,13.6,0.105,2.67,0.255,6.48,3.5000000000000003E-2,0.89,1.2999999999999999E-2,1.3,1.77E-2,17.7]
[804,"00M0804T125","0804",125,"MPP",12.6,"Thinz",1.79,17.899999999999999,0.151,3.83,0.316,8.0299999999999994,3.5000000000000003E-2,0.89,1.4500000000000001E-2,1.4500000000000002,2.5899999999999999E-2,25.9]
[804,"00M0804T160","0804",160,"MPP",16.2,"Thinz",1.79,17.899999999999999,0.151,3.83,0.316,8.0299999999999994,3.5000000000000003E-2,0.89,1.4500000000000001E-2,1.4500000000000002,2.5899999999999999E-2,25.9]
[804,"00M0804T200","0804",200,"MPP",20.2,"Thinz",1.79,17.899999999999999,0.151,3.83,0.316,8.0299999999999994,3.5000000000000003E-2,0.89,1.4500000000000001E-2,1.4500000000000002,2.5899999999999999E-2,25.9]
[804,"00M0804T250","0804",250,"MPP",25.3,"Thinz",1.79,17.899999999999999,0.151,3.83,0.316,8.0299999999999994,3.5000000000000003E-2,0.89,1.4500000000000001E-2,1.4500000000000002,2.5899999999999999E-2,25.9]
["102RT","00K102RT026","102RT",26,"Kool Mu",30,"Segment",35.700000000000003,357,2.25,57.2,6.25,159,0.65,16.5,3.56,356,127,127000]
["130LE","00K130LE026","130LE",26,"Kool Mu",254,"E Core",21.9,219,1.292,32.82,5.28,134.1,2.17,55.12,10.8,1080,237,237000]
["133RT","00K133RT026","133RT",26,"Kool Mu",46,"Segment",47.7,477,3.09,78.599999999999994,8.2200000000000006,209,1,25.4,6.69,669,319,319000]
["160LE","00K160LE026","160LE",26,"Kool Mu",180,"E Core",27.3,273,1.5249999999999999,38.74,6.4,162.6,1.61,40.89,7.78,778,212,212000]
[1808,"00K1808E026","1808",26,"Kool Mu",26,"E Core",4.01,40.099999999999994,0.32600000000000001,8.2799999999999994,0.77200000000000002,19.600000000000001,0.19400000000000001,4.93,0.22800000000000001,22.8,0.91400000000000003,914]
[1808,"00K1808E040","1808",40,"Kool Mu",35,"E Core",4.01,40.099999999999994,0.32600000000000001,8.2799999999999994,0.77200000000000002,19.600000000000001,0.19400000000000001,4.93,0.22800000000000001,22.8,0.91400000000000003,914]
[1808,"00K1808E060","1808",60,"Kool Mu",48,"E Core",4.01,40.099999999999994,0.32600000000000001,8.2799999999999994,0.77200000000000002,19.600000000000001,0.19400000000000001,4.93,0.22800000000000001,22.8,0.91400000000000003,914]
[1808,"00K1808E090","1808",90,"Kool Mu",69,"E Core",4.01,40.099999999999994,0.32600000000000001,8.2799999999999994,0.77200000000000002,19.600000000000001,0.19400000000000001,4.93,0.22800000000000001,22.8,0.91400000000000003,914]
[2510,"00K2510E026","2510",26,"Kool Mu",39,"E Core",4.8500000000000005,48.500000000000007,0.38200000000000001,9.6999999999999993,1.0149999999999999,25.78,0.254,6.45,0.38500000000000001,38.5,1.87,1870]
[2510,"00K2510E040","2510",40,"Kool Mu",52,"E Core",4.8500000000000005,48.500000000000007,0.38200000000000001,9.6999999999999993,1.0149999999999999,25.78,0.254,6.45,0.38500000000000001,38.5,1.87,1870]
[2510,"00K2510E060","2510",60,"Kool Mu",70,"E Core",4.8500000000000005,48.500000000000007,0.38200000000000001,9.6999999999999993,1.0149999999999999,25.78,0.254,6.45,0.38500000000000001,38.5,1.87,1870]
[2510,"00K2510E090","2510",90,"Kool Mu",100,"E Core",4.8500000000000005,48.500000000000007,0.38200000000000001,9.6999999999999993,1.0149999999999999,25.78,0.254,6.45,0.38500000000000001,38.5,1.87,1870]
[3007,"00K3007E026","3007",26,"Kool Mu",33,"E Core",6.56,65.599999999999994,0.6,15.3,1.2030000000000001,30.56,0.28399999999999997,7.21,0.60099999999999998,60.099999999999994,3.94,3940]
[3007,"00K3007E040","3007",40,"Kool Mu",46,"E Core",6.56,65.599999999999994,0.6,15.3,1.2030000000000001,30.56,0.28399999999999997,7.21,0.60099999999999998,60.099999999999994,3.94,3940]
[3007,"00K3007E060","3007",60,"Kool Mu",71,"E Core",6.56,65.599999999999994,0.6,15.3,1.2030000000000001,30.56,0.28399999999999997,7.21,0.60099999999999998,60.099999999999994,3.94,3940]
[3007,"00K3007E090","3007",90,"Kool Mu",92,"E Core",6.56,65.599999999999994,0.6,15.3,1.2030000000000001,30.56,0.28399999999999997,7.21,0.60099999999999998,60.099999999999994,3.94,3940]
[3112,"00K3112U060","3112",60,"Kool Mu",111,"U Core",6.56,65.599999999999994,0.45,11.4,1.25,{"$f":"L114*25.4","v":31.75},0.49,12.5,1.01,101,6.63,6630]
[3112,"00K3112U040","3112",40,"Kool Mu",92,"U Core",6.56,65.599999999999994,0.45,11.4,1.25,{"$f":"L115*25.4","v":31.75},0.49,12.5,1.01,101,6.63,6630]
[3112,"00K3112U090","3112",90,"Kool Mu",179,"U Core",6.56,65.599999999999994,0.45,11.4,1.25,{"$f":"L116*25.4","v":31.75},0.49,12.5,1.01,101,6.63,6630]
[3515,"00K3515E026","3515",26,"Kool Mu",56,"E Core",6.94,69.400000000000006,0.56599999999999995,14.4,1.38,35.049999999999997,0.375,9.5299999999999994,0.84,84,5.83,5830]
[3515,"00K3515E040","3515",40,"Kool Mu",75,"E Core",6.94,69.400000000000006,0.56599999999999995,14.4,1.38,35.049999999999997,0.375,9.5299999999999994,0.84,84,5.83,5830]
[3515,"00K3515E060","3515",60,"Kool Mu",102,"E Core",6.94,69.400000000000006,0.56599999999999995,14.4,1.38,35.049999999999997,0.375,9.5299999999999994,0.84,84,5.83,5830]
[3515,"00K3515E090","3515",90,"Kool Mu",146,"E Core",6.94,69.400000000000006,0.56599999999999995,14.4,1.38,35.049999999999997,0.375,9.5299999999999994,0.84,84,5.83,5830]
[4017,"00K4017E026","4017",26,"Kool Mu",56,"E Core",9.84,98.4,0.84199999999999997,21.4,1.712,43.48,0.434,11,1.28,128,12.6,12600]
[4017,"00K4017E040","4017",40,"Kool Mu",76,"E Core",9.84,98.4,0.84199999999999997,21.4,1.712,43.48,0.434,11,1.28,128,12.6,12600]
[4017,"00K4017E060","4017",60,"Kool Mu",105,"E Core",9.84,98.4,0.84199999999999997,21.4,1.712,43.48,0.434,11,1.28,128,12.6,12600]
[4017,"00K4017E090","4017",90,"Kool Mu",151,"E Core",9.84,98.4,0.84199999999999997,21.4,1.712,43.48,0.434,11,1.28,128,12.6,12600]
[4020,"00K4020E026","4020",26,"Kool Mu",80,"E Core",9.84,98.4,0.84299999999999997,21.4,1.712,43.49,0.61799999999999999,15.7,1.83,183,18,18000]
[4020,"00K4020E040","4020",40,"Kool Mu",108,"E Core",9.84,98.4,0.84299999999999997,21.4,1.712,43.49,0.61799999999999999,15.7,1.83,183,18,18000]
[4020,"00K4020E060","4020",60,"Kool Mu",150,"E Core",9.84,98.4,0.84299999999999997,21.4,1.712,43.49,0.61799999999999999,15.7,1.83,183,18,18000]
[4020,"00K4020E090","4020",90,"Kool Mu",217,"E Core",9.84,98.4,0.84299999999999997,21.4,1.712,43.49,0.61799999999999999,15.7,1.83,183,18,18000]
[4022,"00K4022E026","4022",26,"Kool Mu",104,"E Core",9.84,98.4,0.84299999999999997,21.4,1.712,43.49,0.79800000000000004,20.3,2.37,237,23.3,23300]
[4022,"00K4022E040","4022",40,"Kool Mu",140,"E Core",9.84,98.4,0.84299999999999997,21.4,1.712,43.49,0.79800000000000004,20.3,2.37,237,23.3,23300]
[4022,"00K4022E060","4022",60,"Kool Mu",194,"E Core",9.84,98.4,0.84299999999999997,21.4,1.712,43.49,0.79800000000000004,20.3,2.37,237,23.3,23300]
[4022,"00K4022E090","4022",90,"Kool Mu",281,"E Core",9.84,98.4,0.84299999999999997,21.4,1.712,43.49,0.79800000000000004,20.3,2.37,237,23.3,23300]
[4110,"00K4110U060","4110",60,"Kool Mu",78,"U Core",8.52,85.199999999999989,0.46,11.7,1.62,41.15,0.39,9.91,0.8,80,6.82,6820]
[4110,"00K4110U040","4110",40,"Kool Mu",56,"U Core",8.52,85.199999999999989,0.46,11.7,1.62,41.15,0.39,9.91,0.8,80,6.82,6820]
[4110,"00K4110U090","4110",90,"Kool Mu",109,"U Core",8.52,85.199999999999989,0.46,11.7,1.62,41.15,0.39,9.91,0.8,80,6.82,6820]
[4111,"00K4111U060","4111",60,"Kool Mu",95,"U Core",8.52,85.199999999999989,0.46,11.7,1.62,41.15,0.49,12.5,1.01,101,8.6,8600]
[4111,"00K4111U040","4111",40,"Kool Mu",72,"U Core",8.52,85.199999999999989,0.46,11.7,1.62,41.15,0.49,12.5,1.01,101,8.6,8600]
[4111,"00K4111U090","4111",90,"Kool Mu",138,"U Core",8.52,85.199999999999989,0.46,11.7,1.62,41.15,0.49,12.5,1.01,101,8.6,8600]
[4119,"00K4119U040","4119",40,"Kool Mu",110,"U Core",8.52,85.199999999999989,0.46,11.7,1.62,41.15,0.76500000000000001,19.5,1.59,159,13.6,13600]
[4119,"00K4119U060","4119",60,"Kool Mu",151,"U Core",8.52,85.199999999999989,0.46,11.7,1.62,41.15,0.76500000000000001,19.5,1.59,159,13.6,13600]
[4119,"00K4119U090","4119",90,"Kool Mu",218,"U Core",8.52,85.199999999999989,0.46,11.7,1.62,41.15,0.76500000000000001,19.5,1.59,159,13.6,13600]
[4317,"00K4317E026","4317",26,"Kool Mu",88,"E Core",7.75,77.5,0.66100000000000003,16.8,1.633,41.48,0.5,12.7,1.52,152,11.8,11800]
[4317,"00K4317E040","4317",40,"Kool Mu",119,"E Core",7.75,77.5,0.66100000000000003,16.8,1.633,41.48,0.5,12.7,1.52,152,11.8,11800]
[4317,"00K4317E060","4317",60,"Kool Mu",163,"E Core",7.75,77.5,0.66100000000000003,16.8,1.633,41.48,0.5,12.7,1.52,152,11.8,11800]
[4317,"00K4317E090","4317",90,"Kool Mu",234,"E Core",7.75,77.5,0.66100000000000003,16.8,1.633,41.48,0.5,12.7,1.52,152,11.8,11800]
[55014,"C055014A2","020",173,"MPP",69,"Toroid",1.36,13.6,0.09,2.2799999999999998,0.27500000000000002,6.99,0.13500000000000001,3.43,4.7E-2,4.7,6.4000000000000001E-2,64,4.0800000000000003E-2,{"$f":"C146*1","v":20},{"$f":"VLOOKUP(U146,'Powder Core Toroid OD'!$A$2:$B$36,2,FALSE)","v":6.35}]
[55015,"C055015A2","020",300,"MPP",120,"Toroid",1.36,13.6,0.09,2.2799999999999998,0.27500000000000002,6.99,0.13500000000000001,3.43,4.7E-2,4.7,6.4000000000000001E-2,64,4.0800000000000003E-2,20,{"$f":"VLOOKUP(U147,'Powder Core Toroid OD'!$A$2:$B$36,2,FALSE)","v":6.35}]
[78737,"0078737A7",740,60,"Xflux",204,"Toroid",18.399999999999999,184,1.748,44.39,2.9529999999999998,75.010000000000005,1.4139999999999999,35.92,4.97,497,91.4,91400,15.5,740,{"$f":"VLOOKUP(U148,'Powder Core Toroid OD'!$A$2:$B$36,2,FALSE)","v":74.099999999999994}]
[55017,"C055017A2","020",200,"MPP",80,"Toroid",1.36,13.6,0.09,2.2799999999999998,0.27500000000000002,6.99,0.13500000000000001,3.43,4.7E-2,4.7,6.4000000000000001E-2,64,4.0800000000000003E-2,20,{"$f":"VLOOKUP(U149,'Powder Core Toroid OD'!$A$2:$B$36,2,FALSE)","v":6.35}]
[55018,"C055018A2","020",160,"MPP",64,"Toroid",1.36,13.6,0.09,2.2799999999999998,0.27500000000000002,6.99,0.13500000000000001,3.43,4.7E-2,4.7,6.4000000000000001E-2,64,4.0800000000000003E-2,20,{"$f":"VLOOKUP(U150,'Powder Core Toroid OD'!$A$2:$B$36,2,FALSE)","v":6.35}]
[55019,"C055019A2","020",147,"MPP",59,"Toroid",1.36,13.6,0.09,2.2799999999999998,0.27500000000000002,6.99,0.13500000000000001,3.43,4.7E-2,4.7,6.4000000000000001E-2,64,4.0800000000000003E-2,20,{"$f":"VLOOKUP(U151,'Powder Core Toroid OD'!$A$2:$B$36,2,FALSE)","v":6.35}]
[55020,"C055020A2","020",125,"MPP",50,"Toroid",1.36,13.6,0.09,2.2799999999999998,0.27500000000000002,6.99,0.13500000000000001,3.43,4.7E-2,4.7,6.4000000000000001E-2,64,4.0800000000000003E-2,20,{"$f":"VLOOKUP(U152,'Powder Core Toroid OD'!$A$2:$B$36,2,FALSE)","v":6.35}]
[55021,"C055021A2","020",60,"MPP",24,"Toroid",1.36,13.6,0.09,2.2799999999999998,0.27500000000000002,6.99,0.13500000000000001,3.43,4.7E-2,4.7,6.4000000000000001E-2,64,4.0800000000000003E-2,20,{"$f":"VLOOKUP(U153,'Powder Core Toroid OD'!$A$2:$B$36,2,FALSE)","v":6.35}]
[55022,"0055022A2","020",26,"MPP",10,"Toroid",1.36,13.6,0.09,2.2799999999999998,0.27500000000000002,6.99,0.13500000000000001,3.43,4.7E-2,4.7,6.4000000000000001E-2,64,4.0800000000000003E-2,20,{"$f":"VLOOKUP(U154,'Powder Core Toroid OD'!$A$2:$B$36,2,FALSE)","v":6.35}]
[55023,"0055023A2","020",14,"MPP",6,"Toroid",1.36,13.6,0.09,2.2799999999999998,0.27500000000000002,6.99,0.13500000000000001,3.43,4.7E-2,4.7,6.4000000000000001E-2,64,4.0800000000000003E-2,20,{"$f":"VLOOKUP(U155,'Powder Core Toroid OD'!$A$2:$B$36,2,FALSE)","v":6.35}]
[55024,"C055024A2","030",173,"MPP",73,"Toroid",1.79,17.899999999999999,0.13600000000000001,3.45,0.33500000000000002,8.51,0.15,3.8099999999999996,5.9900000000000002E-2,5.99,0.107,107,9.35E-2,30,{"$f":"VLOOKUP(U156,'Powder Core Toroid OD'!$A$2:$B$36,2,FALSE)","v":7.87}]
[55025,"C055025A2","030",300,"MPP",124,"Toroid",1.79,17.899999999999999,0.13600000000000001,3.45,0.33500000000000002,8.51,0.15,3.8099999999999996,5.9900000000000002E-2,5.99,0.107,107,9.35E-2,30,{"$f":"VLOOKUP(U157,'Powder Core Toroid OD'!$A$2:$B$36,2,FALSE)","v":7.87}]
[78617,"0078617A7",620,60,"XFlux",189,"Toroid",14.4,144,1.248,31.69,2.4769999999999999,62.91,1.02,25.91,3.6,360,51.8,51800,7.89,620,{"$f":"VLOOKUP(U158,'Powder Core Toroid OD'!$A$2:$B$36,2,FALSE)","v":62}]
[55027,"C055027A2","030",200,"MPP",83,"Toroid",1.79,17.899999999999999,0.13600000000000001,3.45,0.33500000000000002,8.51,0.15,3.8099999999999996,5.9900000000000002E-2,5.99,0.107,107,9.35E-2,30,{"$f":"VLOOKUP(U159,'Powder Core Toroid OD'!$A$2:$B$36,2,FALSE)","v":7.87}]
[55028,"C055028A2","030",160,"MPP",66,"Toroid",1.79,17.899999999999999,0.13600000000000001,3.45,0.33500000000000002,8.51,0.15,3.8099999999999996,5.9900000000000002E-2,5.99,0.107,107,9.35E-2,30,{"$f":"VLOOKUP(U160,'Powder Core Toroid OD'!$A$2:$B$36,2,FALSE)","v":7.87}]
[55029,"C055029A2","030",147,"MPP",62,"Toroid",1.79,17.899999999999999,0.13600000000000001,3.45,0.33500000000000002,8.51,0.15,3.8099999999999996,5.9900000000000002E-2,5.99,0.107,107,9.35E-2,30,{"$f":"VLOOKUP(U161,'Powder Core Toroid OD'!$A$2:$B$36,2,FALSE)","v":7.87}]
[55030,"C055030A2","030",125,"MPP",52,"Toroid",1.79,17.899999999999999,0.13600000000000001,3.45,0.33500000000000002,8.51,0.15,3.8099999999999996,5.9900000000000002E-2,5.99,0.107,107,9.35E-2,30,{"$f":"VLOOKUP(U162,'Powder Core Toroid OD'!$A$2:$B$36,2,FALSE)","v":7.87}]
[55031,"C055031A2","030",60,"MPP",25,"Toroid",1.79,17.899999999999999,0.13600000000000001,3.45,0.33500000000000002,8.51,0.15,3.8099999999999996,5.9900000000000002E-2,5.99,0.107,107,9.35E-2,30,{"$f":"VLOOKUP(U163,'Powder Core Toroid OD'!$A$2:$B$36,2,FALSE)","v":7.87}]
[55032,"0055032A2","030",26,"MPP",11,"Toroid",1.79,17.899999999999999,0.13600000000000001,3.45,0.33500000000000002,8.51,0.15,3.8099999999999996,5.9900000000000002E-2,5.99,0.107,107,9.35E-2,30,{"$f":"VLOOKUP(U164,'Powder Core Toroid OD'!$A$2:$B$36,2,FALSE)","v":7.87}]
[55033,"0055033A2","030",14,"MPP",6,"Toroid",1.79,17.899999999999999,0.13600000000000001,3.45,0.33500000000000002,8.51,0.15,3.8099999999999996,5.9900000000000002E-2,5.99,0.107,107,9.35E-2,30,{"$f":"VLOOKUP(U165,'Powder Core Toroid OD'!$A$2:$B$36,2,FALSE)","v":7.87}]
[55034,"C055034A2","040",173,"MPP",92,"Toroid",2.2999999999999998,23,0.18,4.57,0.42499999999999999,10.8,0.18099999999999999,4.5999999999999996,9.5699999999999993E-2,9.5699999999999985,0.22,220,0.16400000000000001,40,{"$f":"VLOOKUP(U166,'Powder Core Toroid OD'!$A$2:$B$36,2,FALSE)","v":10.199999999999999}]
[55035,"C055035A2","040",300,"MPP",159,"Toroid",2.2999999999999998,23,0.18,4.57,0.42499999999999999,10.8,0.18099999999999999,4.5999999999999996,9.5699999999999993E-2,9.5699999999999985,0.22,220,0.16400000000000001,40,{"$f":"VLOOKUP(U167,'Powder Core Toroid OD'!$A$2:$B$36,2,FALSE)","v":10.199999999999999}]
[55036,"C055036A2","040",550,"MPP",290,"Toroid",2.2999999999999998,23,0.18,4.57,0.42499999999999999,10.8,0.18099999999999999,4.5999999999999996,9.5699999999999993E-2,9.5699999999999985,0.22,220,0.16400000000000001,40,{"$f":"VLOOKUP(U168,'Powder Core Toroid OD'!$A$2:$B$36,2,FALSE)","v":10.199999999999999}]
[55037,"C055037A2","040",200,"MPP",105,"Toroid",2.2999999999999998,23,0.18,4.57,0.42499999999999999,10.8,0.18099999999999999,4.5999999999999996,9.5699999999999993E-2,9.5699999999999985,0.22,220,0.16400000000000001,40,{"$f":"VLOOKUP(U169,'Powder Core Toroid OD'!$A$2:$B$36,2,FALSE)","v":10.199999999999999}]
[55038,"C055038A2","040",160,"MPP",84,"Toroid",2.2999999999999998,23,0.18,4.57,0.42499999999999999,10.8,0.18099999999999999,4.5999999999999996,9.5699999999999993E-2,9.5699999999999985,0.22,220,0.16400000000000001,40,{"$f":"VLOOKUP(U170,'Powder Core Toroid OD'!$A$2:$B$36,2,FALSE)","v":10.199999999999999}]
[55039,"C055039A2","040",147,"MPP",78,"Toroid",2.2999999999999998,23,0.18,4.57,0.42499999999999999,10.8,0.18099999999999999,4.5999999999999996,9.5699999999999993E-2,9.5699999999999985,0.22,220,0.16400000000000001,40,{"$f":"VLOOKUP(U171,'Powder Core Toroid OD'!$A$2:$B$36,2,FALSE)","v":10.199999999999999}]
[55040,"C055040A2","040",125,"MPP",66,"Toroid",2.2999999999999998,23,0.18,4.57,0.42499999999999999,10.8,0.18099999999999999,4.5999999999999996,9.5699999999999993E-2,9.5699999999999985,0.22,220,0.16400000000000001,40,{"$f":"VLOOKUP(U172,'Powder Core Toroid OD'!$A$2:$B$36,2,FALSE)","v":10.199999999999999}]
[55041,"C055041A2","040",60,"MPP",32,"Toroid",2.2999999999999998,23,0.18,4.57,0.42499999999999999,10.8,0.18099999999999999,4.5999999999999996,9.5699999999999993E-2,9.5699999999999985,0.22,220,0.16400000000000001,40,{"$f":"VLOOKUP(U173,'Powder Core Toroid OD'!$A$2:$B$36,2,FALSE)","v":10.199999999999999}]
[55042,"0055042A2","040",26,"MPP",14,"Toroid",2.2999999999999998,23,0.18,4.57,0.42499999999999999,10.8,0.18099999999999999,4.5999999999999996,9.5699999999999993E-2,9.5699999999999985,0.22,220,0.16400000000000001,40,{"$f":"VLOOKUP(U174,'Powder Core Toroid OD'!$A$2:$B$36,2,FALSE)","v":10.199999999999999}]
[55043,"0055043A2","040",14,"MPP",7,"Toroid",2.2999999999999998,23,0.18,4.57,0.42499999999999999,10.8,0.18099999999999999,4.5999999999999996,9.5699999999999993E-2,9.5699999999999985,0.22,220,0.16400000000000001,40,{"$f":"VLOOKUP(U175,'Powder Core Toroid OD'!$A$2:$B$36,2,FALSE)","v":10.199999999999999}]
[55044,"C055044A2","050",173,"MPP",79,"Toroid",3.12,31.200000000000003,0.27500000000000002,6.98,0.53,13.5,0.217,5.52,0.109,10.9,0.34,340,0.38300000000000001,50,{"$f":"VLOOKUP(U176,'Powder Core Toroid OD'!$A$2:$B$36,2,FALSE)","v":12.7}]
[55045,"C055045A2","050",300,"MPP",134,"Toroid",3.12,31.200000000000003,0.27500000000000002,6.98,0.53,13.5,0.217,5.52,0.109,10.9,0.34,340,0.38300000000000001,50,{"$f":"VLOOKUP(U177,'Powder Core Toroid OD'!$A$2:$B$36,2,FALSE)","v":12.7}]
[55046,"C055046A2","050",550,"MPP",255,"Toroid",3.12,31.200000000000003,0.27500000000000002,6.98,0.53,13.5,0.217,5.52,0.109,10.9,0.34,340,0.38300000000000001,50,{"$f":"VLOOKUP(U178,'Powder Core Toroid OD'!$A$2:$B$36,2,FALSE)","v":12.7}]
[55047,"C055047A2","050",200,"MPP",90,"Toroid",3.12,31.200000000000003,0.27500000000000002,6.98,0.53,13.5,0.217,5.52,0.109,10.9,0.34,340,0.38300000000000001,50,{"$f":"VLOOKUP(U179,'Powder Core Toroid OD'!$A$2:$B$36,2,FALSE)","v":12.7}]
[55048,"C055048A2","050",160,"MPP",72,"Toroid",3.12,31.200000000000003,0.27500000000000002,6.98,0.53,13.5,0.217,5.52,0.109,10.9,0.34,340,0.38300000000000001,50,{"$f":"VLOOKUP(U180,'Powder Core Toroid OD'!$A$2:$B$36,2,FALSE)","v":12.7}]
[55049,"C055049A2","050",147,"MPP",67,"Toroid",3.12,31.200000000000003,0.27500000000000002,6.98,0.53,13.5,0.217,5.52,0.109,10.9,0.34,340,0.38300000000000001,50,{"$f":"VLOOKUP(U181,'Powder Core Toroid OD'!$A$2:$B$36,2,FALSE)","v":12.7}]
[55050,"C055050A2","050",125,"MPP",56,"Toroid",3.12,31.200000000000003,0.27500000000000002,6.98,0.53,13.5,0.217,5.52,0.109,10.9,0.34,340,0.38300000000000001,50,{"$f":"VLOOKUP(U182,'Powder Core Toroid OD'!$A$2:$B$36,2,FALSE)","v":12.7}]
[55051,"C055051A2","050",60,"MPP",27,"Toroid",3.12,31.200000000000003,0.27500000000000002,6.98,0.53,13.5,0.217,5.52,0.109,10.9,0.34,340,0.38300000000000001,50,{"$f":"VLOOKUP(U183,'Powder Core Toroid OD'!$A$2:$B$36,2,FALSE)","v":12.7}]
[55052,"0055052A2","050",26,"MPP",12,"Toroid",3.12,31.200000000000003,0.27500000000000002,6.98,0.53,13.5,0.217,5.52,0.109,10.9,0.34,340,0.38300000000000001,50,{"$f":"VLOOKUP(U184,'Powder Core Toroid OD'!$A$2:$B$36,2,FALSE)","v":12.7}]
[55053,"0055053A2","050",14,"MPP",6.4,"Toroid",3.12,31.200000000000003,0.27500000000000002,6.98,0.53,13.5,0.217,5.52,0.109,10.9,0.34,340,0.38300000000000001,50,{"$f":"VLOOKUP(U185,'Powder Core Toroid OD'!$A$2:$B$36,2,FALSE)","v":12.7}]
[55059,"C055059A2",310,60,"MPP",43,"Toroid",5.67,56.7,0.52500000000000002,13.3,0.93,23.7,0.33,8.39,0.317,31.7,1.8,1800,1.39,310,{"$f":"VLOOKUP(U186,'Powder Core Toroid OD'!$A$2:$B$36,2,FALSE)","v":22.9}]
[55071,"C055071A2",548,60,"MPP",61,"Toroid",8.14,81.400000000000006,0.76600000000000001,19.399999999999999,1.325,33.659999999999997,0.45,11.5,0.65600000000000003,65.600000000000009,5.34,5340,2.97,548,{"$f":"VLOOKUP(U187,'Powder Core Toroid OD'!$A$2:$B$36,2,FALSE)","v":32.799999999999997}]
[55076,"C055076A2",324,60,"MPP",56,"Toroid",8.98,89.800000000000011,0.84799999999999998,21.5,1.4450000000000001,36.71,0.44700000000000001,11.4,0.67800000000000005,67.800000000000011,6.09,6090,3.64,324,{"$f":"VLOOKUP(U188,'Powder Core Toroid OD'!$A$2:$B$36,2,FALSE)","v":35.799999999999997}]
[55083,"C055083A2",254,60,"MPP",81,"Toroid",9.84,98.4,0.91800000000000004,23.3,1.605,40.770000000000003,0.60499999999999998,15.4,1.07,107,10.6,10600,4.2699999999999996,254,{"$f":"VLOOKUP(U189,'Powder Core Toroid OD'!$A$2:$B$36,2,FALSE)","v":39.9}]
[55084,"C055084A2","089",300,"MPP",427,"Toroid",11.6,116,1.0980000000000001,27.88,1.875,47.63,0.63500000000000001,16.100000000000001,1.34,134,15.6,15600,6.1,89,{"$f":"VLOOKUP(U190,'Powder Core Toroid OD'!$A$2:$B$36,2,FALSE)","v":46.7}]
[55086,"C055086A2","089",200,"MPP",285,"Toroid",11.6,116,1.0980000000000001,27.88,1.875,47.63,0.63500000000000001,16.100000000000001,1.34,134,15.6,15600,6.1,89,{"$f":"VLOOKUP(U191,'Powder Core Toroid OD'!$A$2:$B$36,2,FALSE)","v":46.7}]
[55087,"C055087A2","089",160,"MPP",228,"Toroid",11.6,116,1.0980000000000001,27.88,1.875,47.63,0.63500000000000001,16.100000000000001,1.34,134,15.6,15600,6.1,89,{"$f":"VLOOKUP(U192,'Powder Core Toroid OD'!$A$2:$B$36,2,FALSE)","v":46.7}]
[55088,"C055088A2","089",147,"MPP",210,"Toroid",11.6,116,1.0980000000000001,27.88,1.875,47.63,0.63500000000000001,16.100000000000001,1.34,134,15.6,15600,6.1,89,{"$f":"VLOOKUP(U193,'Powder Core Toroid OD'!$A$2:$B$36,2,FALSE)","v":46.7}]
[55089,"C055089A2","089",125,"MPP",178,"Toroid",11.6,116,1.0980000000000001,27.88,1.875,47.63,0.63500000000000001,16.100000000000001,1.34,134,15.6,15600,6.1,89,{"$f":"VLOOKUP(U194,'Powder Core Toroid OD'!$A$2:$B$36,2,FALSE)","v":46.7}]
[55090,"C055090A2","089",60,"MPP",86,"Toroid",11.6,116,1.0980000000000001,27.88,1.875,47.63,0.63500000000000001,16.100000000000001,1.34,134,15.6,15600,6.1,89,{"$f":"VLOOKUP(U195,'Powder Core Toroid OD'!$A$2:$B$36,2,FALSE)","v":46.7}]
[55091,"0055091A2","089",26,"MPP",37,"Toroid",11.6,116,1.0980000000000001,27.88,1.875,47.63,0.63500000000000001,16.100000000000001,1.34,134,15.6,15600,6.1,89,{"$f":"VLOOKUP(U196,'Powder Core Toroid OD'!$A$2:$B$36,2,FALSE)","v":46.7}]
[55092,"0055092A2","089",14,"MPP",20,"Toroid",11.6,116,1.0980000000000001,27.88,1.875,47.63,0.63500000000000001,16.100000000000001,1.34,134,15.6,15600,6.1,89,{"$f":"VLOOKUP(U197,'Powder Core Toroid OD'!$A$2:$B$36,2,FALSE)","v":46.7}]
[55103,"C055103A2",109,173,"MPP",218,"Toroid",14.3,143,1.3680000000000001,34.74,2.2850000000000001,58.04,0.58499999999999996,14.9,1.44,144,20.7,20700,9.48,109,{"$f":"VLOOKUP(U198,'Powder Core Toroid OD'!$A$2:$B$36,2,FALSE)","v":57.2}]
[55104,"C055104A2",109,300,"MPP",374,"Toroid",14.3,143,1.3680000000000001,34.74,2.2850000000000001,58.04,0.58499999999999996,14.9,1.44,144,20.7,20700,9.48,109,{"$f":"VLOOKUP(U199,'Powder Core Toroid OD'!$A$2:$B$36,2,FALSE)","v":57.2}]
[55106,"C055106A2",109,200,"MPP",250,"Toroid",14.3,143,1.3680000000000001,34.74,2.2850000000000001,58.04,0.58499999999999996,14.9,1.44,144,20.7,20700,9.48,109,{"$f":"VLOOKUP(U200,'Powder Core Toroid OD'!$A$2:$B$36,2,FALSE)","v":57.2}]
[55107,"C055107A2",109,160,"MPP",200,"Toroid",14.3,143,1.3680000000000001,34.74,2.2850000000000001,58.04,0.58499999999999996,14.9,1.44,144,20.7,20700,9.48,109,{"$f":"VLOOKUP(U201,'Powder Core Toroid OD'!$A$2:$B$36,2,FALSE)","v":57.2}]
[55108,"C055108A2",109,147,"MPP",185,"Toroid",14.3,143,1.3680000000000001,34.74,2.2850000000000001,58.04,0.58499999999999996,14.9,1.44,144,20.7,20700,9.48,109,{"$f":"VLOOKUP(U202,'Powder Core Toroid OD'!$A$2:$B$36,2,FALSE)","v":57.2}]
[55109,"C055109A2",109,125,"MPP",156,"Toroid",14.3,143,1.3680000000000001,34.74,2.2850000000000001,58.04,0.58499999999999996,14.9,1.44,144,20.7,20700,9.48,109,{"$f":"VLOOKUP(U203,'Powder Core Toroid OD'!$A$2:$B$36,2,FALSE)","v":57.2}]
[55110,"C055110A2",109,60,"MPP",75,"Toroid",14.3,143,1.3680000000000001,34.74,2.2850000000000001,58.04,0.58499999999999996,14.9,1.44,144,20.7,20700,9.48,109,{"$f":"VLOOKUP(U204,'Powder Core Toroid OD'!$A$2:$B$36,2,FALSE)","v":57.2}]
[55111,"0055111A2",109,26,"MPP",33,"Toroid",14.3,143,1.3680000000000001,34.74,2.2850000000000001,58.04,0.58499999999999996,14.9,1.44,144,20.7,20700,9.48,109,{"$f":"VLOOKUP(U205,'Powder Core Toroid OD'!$A$2:$B$36,2,FALSE)","v":57.2}]
[55112,"0055112A2",109,14,"MPP",18,"Toroid",14.3,143,1.3680000000000001,34.74,2.2850000000000001,58.04,0.58499999999999996,14.9,1.44,144,20.7,20700,9.48,109,{"$f":"VLOOKUP(U206,'Powder Core Toroid OD'!$A$2:$B$36,2,FALSE)","v":57.2}]
[55114,"C055114A2",120,173,"MPP",104,"Toroid",4.12,41.2,0.375,9.52,0.68,17.3,0.28000000000000003,7.12,0.192,19.2,0.79100000000000004,791,0.71199999999999997,120,{"$f":"VLOOKUP(U207,'Powder Core Toroid OD'!$A$2:$B$36,2,FALSE)","v":16.600000000000001}]
[55115,"C055115A2",120,300,"MPP",173,"Toroid",4.12,41.2,0.375,9.52,0.68,17.3,0.28000000000000003,7.12,0.192,19.2,0.79100000000000004,791,0.71199999999999997,120,{"$f":"VLOOKUP(U208,'Powder Core Toroid OD'!$A$2:$B$36,2,FALSE)","v":16.600000000000001}]
[55116,"C055116A2",120,550,"MPP",317,"Toroid",4.12,41.2,0.375,9.52,0.68,17.3,0.28000000000000003,7.12,0.192,19.2,0.79100000000000004,791,0.71199999999999997,120,{"$f":"VLOOKUP(U209,'Powder Core Toroid OD'!$A$2:$B$36,2,FALSE)","v":16.600000000000001}]
[55117,"C055117A2",120,200,"MPP",115,"Toroid",4.12,41.2,0.375,9.52,0.68,17.3,0.28000000000000003,7.12,0.192,19.2,0.79100000000000004,791,0.71199999999999997,{"$f":"C210*1","v":120},{"$f":"VLOOKUP(U210,'Powder Core Toroid OD'!$A$2:$B$36,2,FALSE)","v":16.600000000000001}]
[55118,"C055118A2",120,160,"MPP",92,"Toroid",4.12,41.2,0.375,9.52,0.68,17.3,0.28000000000000003,7.12,0.192,19.2,0.79100000000000004,791,0.71199999999999997,120,{"$f":"VLOOKUP(U211,'Powder Core Toroid OD'!$A$2:$B$36,2,FALSE)","v":16.600000000000001}]
[55119,"C055119A2",120,147,"MPP",88,"Toroid",4.12,41.2,0.375,9.52,0.68,17.3,0.28000000000000003,7.12,0.192,19.2,0.79100000000000004,791,0.71199999999999997,120,{"$f":"VLOOKUP(U212,'Powder Core Toroid OD'!$A$2:$B$36,2,FALSE)","v":16.600000000000001}]
[55120,"C055120A2",120,125,"MPP",72,"Toroid",4.12,41.2,0.375,9.52,0.68,17.3,0.28000000000000003,7.12,0.192,19.2,0.79100000000000004,791,0.71199999999999997,120,{"$f":"VLOOKUP(U213,'Powder Core Toroid OD'!$A$2:$B$36,2,FALSE)","v":16.600000000000001}]
[55121,"C055121A2",120,60,"MPP",35,"Toroid",4.12,41.2,0.375,9.52,0.68,17.3,0.28000000000000003,7.12,0.192,19.2,0.79100000000000004,791,0.71199999999999997,120,{"$f":"VLOOKUP(U214,'Powder Core Toroid OD'!$A$2:$B$36,2,FALSE)","v":16.600000000000001}]
[55122,"0055122A2",120,26,"MPP",15,"Toroid",4.12,41.2,0.375,9.52,0.68,17.3,0.28000000000000003,7.12,0.192,19.2,0.79100000000000004,791,0.71199999999999997,120,{"$f":"VLOOKUP(U215,'Powder Core Toroid OD'!$A$2:$B$36,2,FALSE)","v":16.600000000000001}]
[55123,"0055123A2",120,14,"MPP",8,"Toroid",4.12,41.2,0.375,9.52,0.68,17.3,0.28000000000000003,7.12,0.192,19.2,0.79100000000000004,791,0.71199999999999997,120,{"$f":"VLOOKUP(U216,'Powder Core Toroid OD'!$A$2:$B$36,2,FALSE)","v":16.600000000000001}]
[55124,"C055124A2",130,173,"MPP",74,"Toroid",2.69,26.9,0.23,5.84,0.46500000000000002,11.9,0.18099999999999999,4.5999999999999996,9.06E-2,9.06,0.24399999999999999,244,0.26800000000000002,130,{"$f":"VLOOKUP(U217,'Powder Core Toroid OD'!$A$2:$B$36,2,FALSE)","v":11.2}]
[55125,"C055125A2",130,300,"MPP",127,"Toroid",2.69,26.9,0.23,5.84,0.46500000000000002,11.9,0.18099999999999999,4.5999999999999996,9.06E-2,9.06,0.24399999999999999,244,0.26800000000000002,130,{"$f":"VLOOKUP(U218,'Powder Core Toroid OD'!$A$2:$B$36,2,FALSE)","v":11.2}]
[55127,"C055127A2",130,200,"MPP",85,"Toroid",2.69,26.9,0.23,5.84,0.46500000000000002,11.9,0.18099999999999999,4.5999999999999996,9.06E-2,9.06,0.24399999999999999,244,0.26800000000000002,130,{"$f":"VLOOKUP(U219,'Powder Core Toroid OD'!$A$2:$B$36,2,FALSE)","v":11.2}]
[55128,"C055128A2",130,160,"MPP",68,"Toroid",2.69,26.9,0.23,5.84,0.46500000000000002,11.9,0.18099999999999999,4.5999999999999996,9.06E-2,9.06,0.24399999999999999,244,0.26800000000000002,130,{"$f":"VLOOKUP(U220,'Powder Core Toroid OD'!$A$2:$B$36,2,FALSE)","v":11.2}]
[55129,"C055129A2",130,147,"MPP",63,"Toroid",2.69,26.9,0.23,5.84,0.46500000000000002,11.9,0.18099999999999999,4.5999999999999996,9.06E-2,9.06,0.24399999999999999,244,0.26800000000000002,130,{"$f":"VLOOKUP(U221,'Powder Core Toroid OD'!$A$2:$B$36,2,FALSE)","v":11.2}]
[55130,"C055130A2",130,125,"MPP",53,"Toroid",2.69,26.9,0.23,5.84,0.46500000000000002,11.9,0.18099999999999999,4.5999999999999996,9.06E-2,9.06,0.24399999999999999,244,0.26800000000000002,130,{"$f":"VLOOKUP(U222,'Powder Core Toroid OD'!$A$2:$B$36,2,FALSE)","v":11.2}]
[55131,"C055131A2",130,60,"MPP",26,"Toroid",2.69,26.9,0.23,5.84,0.46500000000000002,11.9,0.18099999999999999,4.5999999999999996,9.06E-2,9.06,0.24399999999999999,244,0.26800000000000002,130,{"$f":"VLOOKUP(U223,'Powder Core Toroid OD'!$A$2:$B$36,2,FALSE)","v":11.2}]
[55132,"0055132A2",130,26,"MPP",11,"Toroid",2.69,26.9,0.23,5.84,0.46500000000000002,11.9,0.18099999999999999,4.5999999999999996,9.06E-2,9.06,0.24399999999999999,244,0.26800000000000002,130,{"$f":"VLOOKUP(U224,'Powder Core Toroid OD'!$A$2:$B$36,2,FALSE)","v":11.2}]
[55133,"0055133A2",130,14,"MPP",6,"Toroid",2.69,26.9,0.23,5.84,0.46500000000000002,11.9,0.18099999999999999,4.5999999999999996,9.06E-2,9.06,0.24399999999999999,244,0.26800000000000002,130,{"$f":"VLOOKUP(U225,'Powder Core Toroid OD'!$A$2:$B$36,2,FALSE)","v":11.2}]
[55134,"0055134A2",140,173,"MPP",36,"Toroid",0.80600000000000005,8.06,0.05,1.27,0.16500000000000001,4.2,8.5000000000000006E-2,2.16,1.2999999999999999E-2,1.3,1.0500000000000001E-2,10.5,1.2699999999999999E-2,140,{"$f":"VLOOKUP(U226,'Powder Core Toroid OD'!$A$2:$B$36,2,FALSE)","v":3.56}]
[55135,"C055135A2",140,300,"MPP",62,"Toroid",0.80600000000000005,8.06,0.05,1.27,0.16500000000000001,4.2,8.5000000000000006E-2,2.16,1.2999999999999999E-2,1.3,1.0500000000000001E-2,10.5,1.2699999999999999E-2,140,{"$f":"VLOOKUP(U227,'Powder Core Toroid OD'!$A$2:$B$36,2,FALSE)","v":3.56}]
[55137,"C055137A2",140,200,"MPP",42,"Toroid",0.80600000000000005,8.06,0.05,1.27,0.16500000000000001,4.2,8.5000000000000006E-2,2.16,1.2999999999999999E-2,1.3,1.0500000000000001E-2,10.5,1.2699999999999999E-2,140,{"$f":"VLOOKUP(U228,'Powder Core Toroid OD'!$A$2:$B$36,2,FALSE)","v":3.56}]
[55138,"C055138A2",140,160,"MPP",33,"Toroid",0.80600000000000005,8.06,0.05,1.27,0.16500000000000001,4.2,8.5000000000000006E-2,2.16,1.2999999999999999E-2,1.3,1.0500000000000001E-2,10.5,1.2699999999999999E-2,140,{"$f":"VLOOKUP(U229,'Powder Core Toroid OD'!$A$2:$B$36,2,FALSE)","v":3.56}]
[55139,"C055139A2",140,147,"MPP",31,"Toroid",0.80600000000000005,8.06,0.05,1.27,0.16500000000000001,4.2,8.5000000000000006E-2,2.16,1.2999999999999999E-2,1.3,1.0500000000000001E-2,10.5,1.2699999999999999E-2,140,{"$f":"VLOOKUP(U230,'Powder Core Toroid OD'!$A$2:$B$36,2,FALSE)","v":3.56}]
[55140,"C055140A2",140,125,"MPP",26,"Toroid",0.80600000000000005,8.06,0.05,1.27,0.16500000000000001,4.2,8.5000000000000006E-2,2.16,1.2999999999999999E-2,1.3,1.0500000000000001E-2,10.5,1.2699999999999999E-2,140,{"$f":"VLOOKUP(U231,'Powder Core Toroid OD'!$A$2:$B$36,2,FALSE)","v":3.56}]
[55144,"C055144A2",150,173,"MPP",48,"Toroid",0.94199999999999995,9.42,6.8000000000000005E-2,1.72,0.18,4.58,0.125,3.18,2.1100000000000001E-2,2.11,1.9900000000000001E-2,19.899999999999999,2.3199999999999998E-2,150,{"$f":"VLOOKUP(U232,'Powder Core Toroid OD'!$A$2:$B$36,2,FALSE)","v":3.94}]
[55145,"C055145A2",150,300,"MPP",84,"Toroid",0.94199999999999995,9.42,6.8000000000000005E-2,1.72,0.18,4.58,0.125,3.18,2.1100000000000001E-2,2.11,1.9900000000000001E-2,19.899999999999999,2.3199999999999998E-2,150,{"$f":"VLOOKUP(U233,'Powder Core Toroid OD'!$A$2:$B$36,2,FALSE)","v":3.94}]
[55147,"C055147A2",150,200,"MPP",56,"Toroid",0.94199999999999995,9.42,6.8000000000000005E-2,1.72,0.18,4.58,0.125,3.18,2.1100000000000001E-2,2.11,1.9900000000000001E-2,19.899999999999999,2.3199999999999998E-2,150,{"$f":"VLOOKUP(U234,'Powder Core Toroid OD'!$A$2:$B$36,2,FALSE)","v":3.94}]
[55148,"C055148A2",150,160,"MPP",45,"Toroid",0.94199999999999995,9.42,6.8000000000000005E-2,1.72,0.18,4.58,0.125,3.18,2.1100000000000001E-2,2.11,1.9900000000000001E-2,19.899999999999999,2.3199999999999998E-2,150,{"$f":"VLOOKUP(U235,'Powder Core Toroid OD'!$A$2:$B$36,2,FALSE)","v":3.94}]
[55149,"C055149A2",150,147,"MPP",41,"Toroid",0.94199999999999995,9.42,6.8000000000000005E-2,1.72,0.18,4.58,0.125,3.18,2.1100000000000001E-2,2.11,1.9900000000000001E-2,19.899999999999999,2.3199999999999998E-2,150,{"$f":"VLOOKUP(U236,'Powder Core Toroid OD'!$A$2:$B$36,2,FALSE)","v":3.94}]
[55150,"C055150A2",150,125,"MPP",35,"Toroid",0.94199999999999995,9.42,6.8000000000000005E-2,1.72,0.18,4.58,0.125,3.18,2.1100000000000001E-2,2.11,1.9900000000000001E-2,19.899999999999999,2.3199999999999998E-2,150,{"$f":"VLOOKUP(U237,'Powder Core Toroid OD'!$A$2:$B$36,2,FALSE)","v":3.94}]
[55174,"C055174A2",180,173,"MPP",57,"Toroid",1.06,10.6,7.2999999999999995E-2,1.85,0.20799999999999999,5.29,0.125,3.18,2.8500000000000001E-2,2.85,3.0300000000000001E-2,30.3,2.69E-2,180,{"$f":"VLOOKUP(U238,'Powder Core Toroid OD'!$A$2:$B$36,2,FALSE)","v":4.6500000000000004}]
[55175,"C055175A2",180,300,"MPP",99,"Toroid",1.06,10.6,7.2999999999999995E-2,1.85,0.20799999999999999,5.29,0.125,3.18,2.8500000000000001E-2,2.85,3.0300000000000001E-2,30.3,2.69E-2,180,{"$f":"VLOOKUP(U239,'Powder Core Toroid OD'!$A$2:$B$36,2,FALSE)","v":4.6500000000000004}]
[55177,"C055177A2",180,200,"MPP",67,"Toroid",1.06,10.6,7.2999999999999995E-2,1.85,0.20799999999999999,5.29,0.125,3.18,2.8500000000000001E-2,2.85,3.0300000000000001E-2,30.3,2.69E-2,180,{"$f":"VLOOKUP(U240,'Powder Core Toroid OD'!$A$2:$B$36,2,FALSE)","v":4.6500000000000004}]
[55178,"C055178A2",180,160,"MPP",53,"Toroid",1.06,10.6,7.2999999999999995E-2,1.85,0.20799999999999999,5.29,0.125,3.18,2.8500000000000001E-2,2.85,3.0300000000000001E-2,30.3,2.69E-2,180,{"$f":"VLOOKUP(U241,'Powder Core Toroid OD'!$A$2:$B$36,2,FALSE)","v":4.6500000000000004}]
[55179,"C055179A2",180,147,"MPP",49,"Toroid",1.06,10.6,7.2999999999999995E-2,1.85,0.20799999999999999,5.29,0.125,3.18,2.8500000000000001E-2,2.85,3.0300000000000001E-2,30.3,2.69E-2,180,{"$f":"VLOOKUP(U242,'Powder Core Toroid OD'!$A$2:$B$36,2,FALSE)","v":4.6500000000000004}]
[55180,"C055180A2",180,125,"MPP",42,"Toroid",1.06,10.6,7.2999999999999995E-2,1.85,0.20799999999999999,5.29,0.125,3.18,2.8500000000000001E-2,2.85,3.0300000000000001E-2,30.3,2.69E-2,180,{"$f":"VLOOKUP(U243,'Powder Core Toroid OD'!$A$2:$B$36,2,FALSE)","v":4.6500000000000004}]
[55181,"C055181A2",180,60,"MPP",20,"Toroid",1.06,10.6,7.2999999999999995E-2,1.85,0.20799999999999999,5.29,0.125,3.18,2.8500000000000001E-2,2.85,3.0300000000000001E-2,30.3,2.69E-2,180,{"$f":"VLOOKUP(U244,'Powder Core Toroid OD'!$A$2:$B$36,2,FALSE)","v":4.6500000000000004}]
[55190,"0055190A2",195,14,"MPP",32,"Toroid",12.5,125,1.0069999999999999,25.57,2.2850000000000001,58.04,0.63500000000000001,16.2,2.29,229,28.6,28600,5.14,195,{"$f":"VLOOKUP(U245,'Powder Core Toroid OD'!$A$2:$B$36,2,FALSE)","v":57.2}]
[55191,"0055191A2",195,26,"MPP",60,"Toroid",12.5,125,1.0069999999999999,25.57,2.2850000000000001,58.04,0.63500000000000001,16.2,2.29,229,28.6,28600,5.14,195,{"$f":"VLOOKUP(U246,'Powder Core Toroid OD'!$A$2:$B$36,2,FALSE)","v":57.2}]
[55192,"C055192A2",195,60,"MPP",138,"Toroid",12.5,125,1.0069999999999999,25.57,2.2850000000000001,58.04,0.63500000000000001,16.2,2.29,229,28.6,28600,5.14,195,{"$f":"VLOOKUP(U247,'Powder Core Toroid OD'!$A$2:$B$36,2,FALSE)","v":57.2}]
[55200,"C055200A2",206,173,"MPP",96,"Toroid",5.09,50.9,0.47500000000000003,12,0.83,21.1,0.28000000000000003,7.12,0.221,22.1,1.1200000000000001,1120,1.1399999999999999,206,{"$f":"VLOOKUP(U248,'Powder Core Toroid OD'!$A$2:$B$36,2,FALSE)","v":20.3}]
[55201,"C055201A2",206,300,"MPP",163,"Toroid",5.09,50.9,0.47500000000000003,12,0.83,21.1,0.28000000000000003,7.12,0.221,22.1,1.1200000000000001,1120,1.1399999999999999,206,{"$f":"VLOOKUP(U249,'Powder Core Toroid OD'!$A$2:$B$36,2,FALSE)","v":20.3}]
[55202,"C055202A2",206,550,"MPP",320,"Toroid",5.09,50.9,0.47500000000000003,12,0.83,21.1,0.28000000000000003,7.12,0.221,22.1,1.1200000000000001,1120,1.1399999999999999,206,{"$f":"VLOOKUP(U250,'Powder Core Toroid OD'!$A$2:$B$36,2,FALSE)","v":20.3}]
[55203,"C055203A2",206,200,"MPP",109,"Toroid",5.09,50.9,0.47500000000000003,12,0.83,21.1,0.28000000000000003,7.12,0.221,22.1,1.1200000000000001,1120,1.1399999999999999,206,{"$f":"VLOOKUP(U251,'Powder Core Toroid OD'!$A$2:$B$36,2,FALSE)","v":20.3}]
[55204,"C055204A2",206,160,"MPP",87,"Toroid",5.09,50.9,0.47500000000000003,12,0.83,21.1,0.28000000000000003,7.12,0.221,22.1,1.1200000000000001,1120,1.1399999999999999,206,{"$f":"VLOOKUP(U252,'Powder Core Toroid OD'!$A$2:$B$36,2,FALSE)","v":20.3}]
[55205,"C055205A2",206,147,"MPP",81,"Toroid",5.09,50.9,0.47500000000000003,12,0.83,21.1,0.28000000000000003,7.12,0.221,22.1,1.1200000000000001,1120,1.1399999999999999,206,{"$f":"VLOOKUP(U253,'Powder Core Toroid OD'!$A$2:$B$36,2,FALSE)","v":20.3}]
[55206,"C055206A2",206,125,"MPP",68,"Toroid",5.09,50.9,0.47500000000000003,12,0.83,21.1,0.28000000000000003,7.12,0.221,22.1,1.1200000000000001,1120,1.1399999999999999,206,{"$f":"VLOOKUP(U254,'Powder Core Toroid OD'!$A$2:$B$36,2,FALSE)","v":20.3}]
[55208,"0055208A2",206,26,"MPP",14,"Toroid",5.09,50.9,0.47500000000000003,12,0.83,21.1,0.28000000000000003,7.12,0.221,22.1,1.1200000000000001,1120,1.1399999999999999,206,{"$f":"VLOOKUP(U255,'Powder Core Toroid OD'!$A$2:$B$36,2,FALSE)","v":20.3}]
[55209,"0055209A2",206,14,"MPP",7.8,"Toroid",5.09,50.9,0.47500000000000003,12,0.83,21.1,0.28000000000000003,7.12,0.221,22.1,1.1200000000000001,1120,1.1399999999999999,206,{"$f":"VLOOKUP(U256,'Powder Core Toroid OD'!$A$2:$B$36,2,FALSE)","v":20.3}]
[55234,"C055234A2",240,173,"MPP",75,"Toroid",1.36,13.6,8.5000000000000006E-2,2.15,0.28499999999999998,7.24,0.125,3.18,4.7600000000000003E-2,4.7600000000000007,6.4899999999999999E-2,64.900000000000006,3.6299999999999999E-2,240,{"$f":"VLOOKUP(U257,'Powder Core Toroid OD'!$A$2:$B$36,2,FALSE)","v":6.6}]
[55235,"C055235A2",240,300,"MPP",130,"Toroid",1.36,13.6,8.5000000000000006E-2,2.15,0.28499999999999998,7.24,0.125,3.18,4.7600000000000003E-2,4.7600000000000007,6.4899999999999999E-2,64.900000000000006,3.6299999999999999E-2,240,{"$f":"VLOOKUP(U258,'Powder Core Toroid OD'!$A$2:$B$36,2,FALSE)","v":6.6}]
[55236,"C055236A2",240,550,"MPP",242,"Toroid",1.36,13.6,8.5000000000000006E-2,2.15,0.28499999999999998,7.24,0.125,3.18,4.7600000000000003E-2,4.7600000000000007,6.4899999999999999E-2,64.900000000000006,3.6299999999999999E-2,240,{"$f":"VLOOKUP(U259,'Powder Core Toroid OD'!$A$2:$B$36,2,FALSE)","v":6.6}]
[55237,"C055237A2",240,200,"MPP",86,"Toroid",1.36,13.6,8.5000000000000006E-2,2.15,0.28499999999999998,7.24,0.125,3.18,4.7600000000000003E-2,4.7600000000000007,6.4899999999999999E-2,64.900000000000006,3.6299999999999999E-2,240,{"$f":"VLOOKUP(U260,'Powder Core Toroid OD'!$A$2:$B$36,2,FALSE)","v":6.6}]
[55238,"C055238A2",240,160,"MPP",69,"Toroid",1.36,13.6,8.5000000000000006E-2,2.15,0.28499999999999998,7.24,0.125,3.18,4.7600000000000003E-2,4.7600000000000007,6.4899999999999999E-2,64.900000000000006,3.6299999999999999E-2,240,{"$f":"VLOOKUP(U261,'Powder Core Toroid OD'!$A$2:$B$36,2,FALSE)","v":6.6}]
[55239,"C055239A2",240,147,"MPP",64,"Toroid",1.36,13.6,8.5000000000000006E-2,2.15,0.28499999999999998,7.24,0.125,3.18,4.7600000000000003E-2,4.7600000000000007,6.4899999999999999E-2,64.900000000000006,3.6299999999999999E-2,240,{"$f":"VLOOKUP(U262,'Powder Core Toroid OD'!$A$2:$B$36,2,FALSE)","v":6.6}]
[55240,"C055240A2",240,125,"MPP",54,"Toroid",1.36,13.6,8.5000000000000006E-2,2.15,0.28499999999999998,7.24,0.125,3.18,4.7600000000000003E-2,4.7600000000000007,6.4899999999999999E-2,64.900000000000006,3.6299999999999999E-2,240,{"$f":"VLOOKUP(U263,'Powder Core Toroid OD'!$A$2:$B$36,2,FALSE)","v":6.6}]
[55241,"C055241A2",240,60,"MPP",26,"Toroid",1.36,13.6,8.5000000000000006E-2,2.15,0.28499999999999998,7.24,0.125,3.18,4.7600000000000003E-2,4.7600000000000007,6.4899999999999999E-2,64.900000000000006,3.6299999999999999E-2,240,{"$f":"VLOOKUP(U264,'Powder Core Toroid OD'!$A$2:$B$36,2,FALSE)","v":6.6}]
[55242,"0055242A2",240,26,"MPP",11,"Toroid",1.36,13.6,8.5000000000000006E-2,2.15,0.28499999999999998,7.24,0.125,3.18,4.7600000000000003E-2,4.7600000000000007,6.4899999999999999E-2,64.900000000000006,3.6299999999999999E-2,240,{"$f":"VLOOKUP(U265,'Powder Core Toroid OD'!$A$2:$B$36,2,FALSE)","v":6.6}]
[55243,"0055243A2",240,14,"MPP",6,"Toroid",1.36,13.6,8.5000000000000006E-2,2.15,0.28499999999999998,7.24,0.125,3.18,4.7600000000000003E-2,4.7600000000000007,6.4899999999999999E-2,64.900000000000006,3.6299999999999999E-2,240,{"$f":"VLOOKUP(U266,'Powder Core Toroid OD'!$A$2:$B$36,2,FALSE)","v":6.6}]
[55248,"C055248A2",254,173,"MPP",233,"Toroid",9.84,98.4,0.91800000000000004,23.3,1.605,40.770000000000003,0.60499999999999998,15.4,1.07,107,10.6,10600,4.2699999999999996,254,{"$f":"VLOOKUP(U267,'Powder Core Toroid OD'!$A$2:$B$36,2,FALSE)","v":39.9}]
[55249,"C055249A2",254,300,"MPP",403,"Toroid",9.84,98.4,0.91800000000000004,23.3,1.605,40.770000000000003,0.60499999999999998,15.4,1.07,107,10.6,10600,4.2699999999999996,254,{"$f":"VLOOKUP(U268,'Powder Core Toroid OD'!$A$2:$B$36,2,FALSE)","v":39.9}]
[55250,"C055250A2",254,550,"MPP",740,"Toroid",9.84,98.4,0.91800000000000004,23.3,1.605,40.770000000000003,0.60499999999999998,15.4,1.07,107,10.6,10600,4.2699999999999996,254,{"$f":"VLOOKUP(U269,'Powder Core Toroid OD'!$A$2:$B$36,2,FALSE)","v":39.9}]
[55251,"C055251A2",254,200,"MPP",269,"Toroid",9.84,98.4,0.91800000000000004,23.3,1.605,40.770000000000003,0.60499999999999998,15.4,1.07,107,10.6,10600,4.2699999999999996,254,{"$f":"VLOOKUP(U270,'Powder Core Toroid OD'!$A$2:$B$36,2,FALSE)","v":39.9}]
[55252,"C055252A2",254,160,"MPP",215,"Toroid",9.84,98.4,0.91800000000000004,23.3,1.605,40.770000000000003,0.60499999999999998,15.4,1.07,107,10.6,10600,4.2699999999999996,254,{"$f":"VLOOKUP(U271,'Powder Core Toroid OD'!$A$2:$B$36,2,FALSE)","v":39.9}]
[55253,"C055253A2",254,147,"MPP",198,"Toroid",9.84,98.4,0.91800000000000004,23.3,1.605,40.770000000000003,0.60499999999999998,15.4,1.07,107,10.6,10600,4.2699999999999996,254,{"$f":"VLOOKUP(U272,'Powder Core Toroid OD'!$A$2:$B$36,2,FALSE)","v":39.9}]
[55254,"C055254A2",254,125,"MPP",168,"Toroid",9.84,98.4,0.91800000000000004,23.3,1.605,40.770000000000003,0.60499999999999998,15.4,1.07,107,10.6,10600,4.2699999999999996,254,{"$f":"VLOOKUP(U273,'Powder Core Toroid OD'!$A$2:$B$36,2,FALSE)","v":39.9}]
[55256,"0055256A2",254,26,"MPP",35,"Toroid",9.84,98.4,0.91800000000000004,23.3,1.605,40.770000000000003,0.60499999999999998,15.4,1.07,107,10.6,10600,4.2699999999999996,{"$f":"C274*1","v":254},{"$f":"VLOOKUP(U274,'Powder Core Toroid OD'!$A$2:$B$36,2,FALSE)","v":39.9}]
[55257,"0055257A2",254,14,"MPP",19,"Toroid",9.84,98.4,0.91800000000000004,23.3,1.605,40.770000000000003,0.60499999999999998,15.4,1.07,107,10.6,10600,4.2699999999999996,254,{"$f":"VLOOKUP(U275,'Powder Core Toroid OD'!$A$2:$B$36,2,FALSE)","v":39.9}]
[55264,"C055264A2",270,173,"MPP",144,"Toroid",1.36,13.6,8.5000000000000006E-2,2.15,0.28500000000000003,7.24,0.21299999999999999,5.42,9.1999999999999998E-2,9.1999999999999993,0.125,125,3.6299999999999999E-2,270,{"$f":"VLOOKUP(U276,'Powder Core Toroid OD'!$A$2:$B$36,2,FALSE)","v":6.6}]
[55265,"C055265A2",270,300,"MPP",247,"Toroid",1.36,13.6,8.5000000000000006E-2,2.15,0.28500000000000003,7.24,0.21299999999999999,5.42,9.1999999999999998E-2,9.1999999999999993,0.125,125,3.6299999999999999E-2,270,{"$f":"VLOOKUP(U277,'Powder Core Toroid OD'!$A$2:$B$36,2,FALSE)","v":6.6}]
[55266,"C055266A2",270,550,"MPP",466,"Toroid",1.36,13.6,8.5000000000000006E-2,2.15,0.28500000000000003,7.24,0.21299999999999999,5.42,9.1999999999999998E-2,9.1999999999999993,0.125,125,3.6299999999999999E-2,270,{"$f":"VLOOKUP(U278,'Powder Core Toroid OD'!$A$2:$B$36,2,FALSE)","v":6.6}]
[55267,"C055267A2",270,200,"MPP",165,"Toroid",1.36,13.6,8.5000000000000006E-2,2.15,0.28500000000000003,7.24,0.21299999999999999,5.42,9.1999999999999998E-2,9.1999999999999993,0.125,125,3.6299999999999999E-2,270,{"$f":"VLOOKUP(U279,'Powder Core Toroid OD'!$A$2:$B$36,2,FALSE)","v":6.6}]
[55268,"C055268A2",270,160,"MPP",132,"Toroid",1.36,13.6,8.5000000000000006E-2,2.15,0.28500000000000003,7.24,0.21299999999999999,5.42,9.1999999999999998E-2,9.1999999999999993,0.125,125,3.6299999999999999E-2,270,{"$f":"VLOOKUP(U280,'Powder Core Toroid OD'!$A$2:$B$36,2,FALSE)","v":6.6}]
[55269,"C055269A2",270,147,"MPP",122,"Toroid",1.36,13.6,8.5000000000000006E-2,2.15,0.28500000000000003,7.24,0.21299999999999999,5.42,9.1999999999999998E-2,9.1999999999999993,0.125,125,3.6299999999999999E-2,270,{"$f":"VLOOKUP(U281,'Powder Core Toroid OD'!$A$2:$B$36,2,FALSE)","v":6.6}]
[5527,"00K5527U026","5527",26,"Kool Mu",67,"U Core",16.8,168,1.101,27.97,2.1850000000000001,55.5,0.65800000000000003,16.7,1.72,172,28.9,28900]
[55270,"C055270A2",270,125,"MPP",103,"Toroid",1.36,13.6,8.5000000000000006E-2,2.15,0.28500000000000003,7.24,0.21299999999999999,5.42,9.1999999999999998E-2,9.1999999999999993,0.125,125,3.6299999999999999E-2,{"$f":"C283*1","v":270},{"$f":"VLOOKUP(U283,'Powder Core Toroid OD'!$A$2:$B$36,2,FALSE)","v":6.6}]
[55271,"C055271A2",270,60,"MPP",50,"Toroid",1.36,13.6,8.5000000000000006E-2,2.15,0.28500000000000003,7.24,0.21299999999999999,5.42,9.1999999999999998E-2,9.1999999999999993,0.125,125,3.6299999999999999E-2,270,{"$f":"VLOOKUP(U284,'Powder Core Toroid OD'!$A$2:$B$36,2,FALSE)","v":6.6}]
[55272,"0055272A2",270,26,"MPP",21,"Toroid",1.36,13.6,8.5000000000000006E-2,2.15,0.28500000000000003,7.24,0.21299999999999999,5.42,9.1999999999999998E-2,9.1999999999999993,0.125,125,3.6299999999999999E-2,270,{"$f":"VLOOKUP(U285,'Powder Core Toroid OD'!$A$2:$B$36,2,FALSE)","v":6.6}]
[55274,"C055274A2",280,173,"MPP",74,"Toroid",2.1800000000000002,21.8,0.16800000000000001,4.26,0.40500000000000003,10.3,0.15,3.8099999999999996,7.5200000000000003E-2,7.52,0.16400000000000001,164,0.14299999999999999,280,{"$f":"VLOOKUP(U286,'Powder Core Toroid OD'!$A$2:$B$36,2,FALSE)","v":9.65}]
[55275,"C055275A2",280,300,"MPP",128,"Toroid",2.1800000000000002,21.8,0.16800000000000001,4.26,0.40500000000000003,10.3,0.15,3.8099999999999996,7.5200000000000003E-2,7.52,0.16400000000000001,164,0.14299999999999999,280,{"$f":"VLOOKUP(U287,'Powder Core Toroid OD'!$A$2:$B$36,2,FALSE)","v":9.65}]
[55276,"C055276A2",280,550,"MPP",232,"Toroid",2.1800000000000002,21.8,0.16800000000000001,4.26,0.40500000000000003,10.3,0.15,3.8099999999999996,7.5200000000000003E-2,7.52,0.16400000000000001,164,0.14299999999999999,280,{"$f":"VLOOKUP(U288,'Powder Core Toroid OD'!$A$2:$B$36,2,FALSE)","v":9.65}]
[55277,"C055277A2",280,200,"MPP",84,"Toroid",2.1800000000000002,21.8,0.16800000000000001,4.26,0.40500000000000003,10.3,0.15,3.8099999999999996,7.5200000000000003E-2,7.52,0.16400000000000001,164,0.14299999999999999,280,{"$f":"VLOOKUP(U289,'Powder Core Toroid OD'!$A$2:$B$36,2,FALSE)","v":9.65}]
[55278,"C055278A2",280,160,"MPP",68,"Toroid",2.1800000000000002,21.8,0.16800000000000001,4.26,0.40500000000000003,10.3,0.15,3.8099999999999996,7.5200000000000003E-2,7.52,0.16400000000000001,164,0.14299999999999999,280,{"$f":"VLOOKUP(U290,'Powder Core Toroid OD'!$A$2:$B$36,2,FALSE)","v":9.65}]
[55279,"C055279A2",280,147,"MPP",63,"Toroid",2.1800000000000002,21.8,0.16800000000000001,4.26,0.40500000000000003,10.3,0.15,3.8099999999999996,7.5200000000000003E-2,7.52,0.16400000000000001,164,0.14299999999999999,280,{"$f":"VLOOKUP(U291,'Powder Core Toroid OD'!$A$2:$B$36,2,FALSE)","v":9.65}]
[5528,"00K5528E026","5528",26,"Kool Mu",116,"E Core",12.3,123,1.101,27.97,2.1920000000000002,55.68,0.82699999999999996,21,3.5,350,43.1,43100]
[5528,"00K5528E040","5528",40,"Kool Mu",157,"E Core",12.3,123,1.101,27.97,2.1920000000000002,55.68,0.82699999999999996,21,3.5,350,43.1,43100]
[5528,"00K5528E060","5528",60,"Kool Mu",219,"E Core",12.3,123,1.101,27.97,2.1920000000000002,55.68,0.82699999999999996,21,3.5,350,43.1,43100]
[5528,"00K5528E090","5528",90,"Kool Mu",322,"E Core",12.3,123,1.101,27.97,2.1920000000000002,55.68,0.82699999999999996,21,3.5,350,43.1,43100]
[55280,"C055280A2",280,125,"MPP",53,"Toroid",2.1800000000000002,21.8,0.16800000000000001,4.26,0.40500000000000003,10.3,0.15,3.8099999999999996,7.5200000000000003E-2,7.52,0.16400000000000001,164,0.14299999999999999,{"$f":"C296*1","v":280},{"$f":"VLOOKUP(U296,'Powder Core Toroid OD'!$A$2:$B$36,2,FALSE)","v":9.65}]
[55281,"C055281A2",280,60,"MPP",25,"Toroid",2.1800000000000002,21.8,0.16800000000000001,4.26,0.40500000000000003,10.3,0.15,3.8099999999999996,7.5200000000000003E-2,7.52,0.16400000000000001,164,0.14299999999999999,280,{"$f":"VLOOKUP(U297,'Powder Core Toroid OD'!$A$2:$B$36,2,FALSE)","v":9.65}]
[55282,"0055282A2",280,26,"MPP",11,"Toroid",2.1800000000000002,21.8,0.16800000000000001,4.26,0.40500000000000003,10.3,0.15,3.8099999999999996,7.5200000000000003E-2,7.52,0.16400000000000001,164,0.14299999999999999,280,{"$f":"VLOOKUP(U298,'Powder Core Toroid OD'!$A$2:$B$36,2,FALSE)","v":9.65}]
[55283,"0055283A2",280,14,"MPP",6,"Toroid",2.1800000000000002,21.8,0.16800000000000001,4.26,0.40500000000000003,10.3,0.15,3.8099999999999996,7.5200000000000003E-2,7.52,0.16400000000000001,164,0.14299999999999999,280,{"$f":"VLOOKUP(U299,'Powder Core Toroid OD'!$A$2:$B$36,2,FALSE)","v":9.65}]
[55284,"C055284A2",290,173,"MPP",92,"Toroid",2.1800000000000002,21.8,0.16800000000000001,4.26,0.40500000000000003,10.3,0.18099999999999999,4.5999999999999996,9.4500000000000001E-2,9.4499999999999993,0.20599999999999999,206,0.14299999999999999,290,{"$f":"VLOOKUP(U300,'Powder Core Toroid OD'!$A$2:$B$36,2,FALSE)","v":9.65}]
[55285,"C055285A2",290,300,"MPP",159,"Toroid",2.1800000000000002,21.8,0.16800000000000001,4.26,0.40500000000000003,10.3,0.18099999999999999,4.5999999999999996,9.4500000000000001E-2,9.4499999999999993,0.20599999999999999,206,0.14299999999999999,290,{"$f":"VLOOKUP(U301,'Powder Core Toroid OD'!$A$2:$B$36,2,FALSE)","v":9.65}]
[55286,"C055286A2",290,550,"MPP",290,"Toroid",2.1800000000000002,21.8,0.16800000000000001,4.26,0.40500000000000003,10.3,0.18099999999999999,4.5999999999999996,9.4500000000000001E-2,9.4499999999999993,0.20599999999999999,206,0.14299999999999999,290,{"$f":"VLOOKUP(U302,'Powder Core Toroid OD'!$A$2:$B$36,2,FALSE)","v":9.65}]
[55287,"C055287A2",290,200,"MPP",105,"Toroid",2.1800000000000002,21.8,0.16800000000000001,4.26,0.40500000000000003,10.3,0.18099999999999999,4.5999999999999996,9.4500000000000001E-2,9.4499999999999993,0.20599999999999999,206,0.14299999999999999,290,{"$f":"VLOOKUP(U303,'Powder Core Toroid OD'!$A$2:$B$36,2,FALSE)","v":9.65}]
[55288,"C055288A2",290,160,"MPP",84,"Toroid",2.1800000000000002,21.8,0.16800000000000001,4.26,0.40500000000000003,10.3,0.18099999999999999,4.5999999999999996,9.4500000000000001E-2,9.4499999999999993,0.20599999999999999,206,0.14299999999999999,290,{"$f":"VLOOKUP(U304,'Powder Core Toroid OD'!$A$2:$B$36,2,FALSE)","v":9.65}]
[55289,"C055289A2",290,147,"MPP",78,"Toroid",2.1800000000000002,21.8,0.16800000000000001,4.26,0.40500000000000003,10.3,0.18099999999999999,4.5999999999999996,9.4500000000000001E-2,9.4499999999999993,0.20599999999999999,206,0.14299999999999999,290,{"$f":"VLOOKUP(U305,'Powder Core Toroid OD'!$A$2:$B$36,2,FALSE)","v":9.65}]
[5529,"00K5529U026","5529",26,"Kool Mu",85,"U Core",16.8,168,1.105,28.07,2.1850000000000001,55.5,0.92700000000000005,23.5,2.44,244,41,41000]
[55290,"C055290A2",290,125,"MPP",66,"Toroid",2.1800000000000002,21.8,0.16800000000000001,4.26,0.40500000000000003,10.3,0.18099999999999999,4.5999999999999996,9.4500000000000001E-2,9.4499999999999993,0.20599999999999999,206,0.14299999999999999,{"$f":"C307*1","v":290},{"$f":"VLOOKUP(U307,'Powder Core Toroid OD'!$A$2:$B$36,2,FALSE)","v":9.65}]
[55291,"C055291A2",290,60,"MPP",32,"Toroid",2.1800000000000002,21.8,0.16800000000000001,4.26,0.40500000000000003,10.3,0.18099999999999999,4.5999999999999996,9.4500000000000001E-2,9.4499999999999993,0.20599999999999999,206,0.14299999999999999,{"$f":"C308*1","v":290},{"$f":"VLOOKUP(U308,'Powder Core Toroid OD'!$A$2:$B$36,2,FALSE)","v":9.65}]
[55292,"0055292A2",290,26,"MPP",14,"Toroid",2.1800000000000002,21.8,0.16800000000000001,4.26,0.40500000000000003,10.3,0.18099999999999999,4.5999999999999996,9.4500000000000001E-2,9.4499999999999993,0.20599999999999999,206,0.14299999999999999,{"$f":"C309*1","v":290},{"$f":"VLOOKUP(U309,'Powder Core Toroid OD'!$A$2:$B$36,2,FALSE)","v":9.65}]
[55293,"0055293A2",290,14,"MPP",7,"Toroid",2.1800000000000002,21.8,0.16800000000000001,4.26,0.40500000000000003,10.3,0.18099999999999999,4.5999999999999996,9.4500000000000001E-2,9.4499999999999993,0.20599999999999999,206,0.14299999999999999,{"$f":"C310*1","v":290},{"$f":"VLOOKUP(U310,'Powder Core Toroid OD'!$A$2:$B$36,2,FALSE)","v":9.65}]
[5530,"00K5530E026","5530",26,"Kool Mu",138,"E Core",12.3,123,1.101,27.97,2.1920000000000002,55.68,0.98399999999999999,25,4.17,417,51.3,51300]
[5530,"00K5530E040","5530",40,"Kool Mu",187,"E Core",12.3,123,1.101,27.97,2.1920000000000002,55.68,0.98399999999999999,25,4.17,417,51.3,51300]
[5530,"00K5530E060","5530",60,"Kool Mu",261,"E Core",12.3,123,1.101,27.97,2.1920000000000002,55.68,0.98399999999999999,25,4.17,417,51.3,51300]
[5530,"00K5530E090","5530",90,"Kool Mu",338,"E Core",12.3,123,1.101,27.97,2.1920000000000002,55.68,0.98399999999999999,25,4.17,417,51.3,51300]
[55304,"C055304A2",310,173,"MPP",124,"Toroid",5.67,56.7,0.52500000000000002,13.3,0.93,23.7,0.33,8.39,0.317,31.7,1.8,1800,1.39,{"$f":"C315*1","v":310},{"$f":"VLOOKUP(U315,'Powder Core Toroid OD'!$A$2:$B$36,2,FALSE)","v":22.9}]
[55305,"C055305A2",310,300,"MPP",216,"Toroid",5.67,56.7,0.52500000000000002,13.3,0.93,23.7,0.33,8.39,0.317,31.7,1.8,1800,1.39,310,{"$f":"VLOOKUP(U316,'Powder Core Toroid OD'!$A$2:$B$36,2,FALSE)","v":22.9}]
[55306,"C055306A2",310,550,"MPP",396,"Toroid",5.67,56.7,0.52500000000000002,13.3,0.93,23.7,0.33,8.39,0.317,31.7,1.8,1800,1.39,310,{"$f":"VLOOKUP(U317,'Powder Core Toroid OD'!$A$2:$B$36,2,FALSE)","v":22.9}]
[55307,"C055307A2",310,200,"MPP",144,"Toroid",5.67,56.7,0.52500000000000002,13.3,0.93,23.7,0.33,8.39,0.317,31.7,1.8,1800,1.39,310,{"$f":"VLOOKUP(U318,'Powder Core Toroid OD'!$A$2:$B$36,2,FALSE)","v":22.9}]
[55308,"C055308A2",310,160,"MPP",115,"Toroid",5.67,56.7,0.52500000000000002,13.3,0.93,23.7,0.33,8.39,0.317,31.7,1.8,1800,1.39,310,{"$f":"VLOOKUP(U319,'Powder Core Toroid OD'!$A$2:$B$36,2,FALSE)","v":22.9}]
[55309,"C055309A2",310,147,"MPP",106,"Toroid",5.67,56.7,0.52500000000000002,13.3,0.93,23.7,0.33,8.39,0.317,31.7,1.8,1800,1.39,310,{"$f":"VLOOKUP(U320,'Powder Core Toroid OD'!$A$2:$B$36,2,FALSE)","v":22.9}]
[55310,"C055310A2",310,125,"MPP",90,"Toroid",5.67,56.7,0.52500000000000002,13.3,0.93,23.7,0.33,8.39,0.317,31.7,1.8,1800,1.39,310,{"$f":"VLOOKUP(U321,'Powder Core Toroid OD'!$A$2:$B$36,2,FALSE)","v":22.9}]
[55312,"0055312A2",310,26,"MPP",19,"Toroid",5.67,56.7,0.52500000000000002,13.3,0.93,23.7,0.33,8.39,0.317,31.7,1.8,1800,1.39,310,{"$f":"VLOOKUP(U322,'Powder Core Toroid OD'!$A$2:$B$36,2,FALSE)","v":22.9}]
[55313,"0055313A2",310,14,"MPP",9.9,"Toroid",5.67,56.7,0.52500000000000002,13.3,0.93,23.7,0.33,8.39,0.317,31.7,1.8,1800,1.39,310,{"$f":"VLOOKUP(U323,'Powder Core Toroid OD'!$A$2:$B$36,2,FALSE)","v":22.9}]
[55318,"C055318A2",324,173,"MPP",162,"Toroid",8.98,89.800000000000011,0.84799999999999998,21.5,1.4450000000000001,36.71,0.44700000000000001,11.4,0.67800000000000005,67.800000000000011,6.09,6090,3.64,324,{"$f":"VLOOKUP(U324,'Powder Core Toroid OD'!$A$2:$B$36,2,FALSE)","v":35.799999999999997}]
[55319,"C055319A2",324,300,"MPP",281,"Toroid",8.98,89.800000000000011,0.84799999999999998,21.5,1.4450000000000001,36.71,0.44700000000000001,11.4,0.67800000000000005,67.800000000000011,6.09,6090,3.64,324,{"$f":"VLOOKUP(U325,'Powder Core Toroid OD'!$A$2:$B$36,2,FALSE)","v":35.799999999999997}]
[55320,"C055320A2",324,550,"MPP",515,"Toroid",8.98,89.800000000000011,0.84799999999999998,21.5,1.4450000000000001,36.71,0.44700000000000001,11.4,0.67800000000000005,67.800000000000011,6.09,6090,3.64,324,{"$f":"VLOOKUP(U326,'Powder Core Toroid OD'!$A$2:$B$36,2,FALSE)","v":35.799999999999997}]
[55321,"C055321A2",324,200,"MPP",187,"Toroid",8.98,89.800000000000011,0.84799999999999998,21.5,1.4450000000000001,36.71,0.44700000000000001,11.4,0.67800000000000005,67.800000000000011,6.09,6090,3.64,324,{"$f":"VLOOKUP(U327,'Powder Core Toroid OD'!$A$2:$B$36,2,FALSE)","v":35.799999999999997}]
[55322,"C055322A2",324,160,"MPP",150,"Toroid",8.98,89.800000000000011,0.84799999999999998,21.5,1.4450000000000001,36.71,0.44700000000000001,11.4,0.67800000000000005,67.800000000000011,6.09,6090,3.64,324,{"$f":"VLOOKUP(U328,'Powder Core Toroid OD'!$A$2:$B$36,2,FALSE)","v":35.799999999999997}]
[55323,"C055323A2",324,147,"MPP",138,"Toroid",8.98,89.800000000000011,0.84799999999999998,21.5,1.4450000000000001,36.71,0.44700000000000001,11.4,0.67800000000000005,67.800000000000011,6.09,6090,3.64,324,{"$f":"VLOOKUP(U329,'Powder Core Toroid OD'!$A$2:$B$36,2,FALSE)","v":35.799999999999997}]
[55324,"C055324A2",324,125,"MPP",117,"Toroid",8.98,89.800000000000011,0.84799999999999998,21.5,1.4450000000000001,36.71,0.44700000000000001,11.4,0.67800000000000005,67.800000000000011,6.09,6090,3.64,324,{"$f":"VLOOKUP(U330,'Powder Core Toroid OD'!$A$2:$B$36,2,FALSE)","v":35.799999999999997}]
[55326,"0055326A2",324,26,"MPP",24,"Toroid",8.98,89.800000000000011,0.84799999999999998,21.5,1.4450000000000001,36.71,0.44700000000000001,11.4,0.67800000000000005,67.800000000000011,6.09,6090,3.64,324,{"$f":"VLOOKUP(U331,'Powder Core Toroid OD'!$A$2:$B$36,2,FALSE)","v":35.799999999999997}]
[55327,"0055327A2",324,14,"MPP",13,"Toroid",8.98,89.800000000000011,0.84799999999999998,21.5,1.4450000000000001,36.71,0.44700000000000001,11.4,0.67800000000000005,67.800000000000011,6.09,6090,3.64,324,{"$f":"VLOOKUP(U332,'Powder Core Toroid OD'!$A$2:$B$36,2,FALSE)","v":35.799999999999997}]
[55344,"C055344A2",350,173,"MPP",146,"Toroid",5.88,58.8,0.54200000000000004,13.7,0.95799999999999996,24.4,0.38,9.66,0.38800000000000001,38.800000000000004,2.2799999999999998,2280,1.49,350,{"$f":"VLOOKUP(U333,'Powder Core Toroid OD'!$A$2:$B$36,2,FALSE)","v":23.6}]
[55345,"C055345A2",350,300,"MPP",253,"Toroid",5.88,58.8,0.54200000000000004,13.7,0.95799999999999996,24.4,0.38,9.66,0.38800000000000001,38.800000000000004,2.2799999999999998,2280,1.49,350,{"$f":"VLOOKUP(U334,'Powder Core Toroid OD'!$A$2:$B$36,2,FALSE)","v":23.6}]
[55347,"C055347A2",350,200,"MPP",169,"Toroid",5.88,58.8,0.54200000000000004,13.7,0.95799999999999996,24.4,0.38,9.66,0.38800000000000001,38.800000000000004,2.2799999999999998,2280,1.49,350,{"$f":"VLOOKUP(U335,'Powder Core Toroid OD'!$A$2:$B$36,2,FALSE)","v":23.6}]
[55348,"C055348A2",350,160,"MPP",135,"Toroid",5.88,58.8,0.54200000000000004,13.7,0.95799999999999996,24.4,0.38,9.66,0.38800000000000001,38.800000000000004,2.2799999999999998,2280,1.49,350,{"$f":"VLOOKUP(U336,'Powder Core Toroid OD'!$A$2:$B$36,2,FALSE)","v":23.6}]
[55349,"C055349A2",350,147,"MPP",124,"Toroid",5.88,58.8,0.54200000000000004,13.7,0.95799999999999996,24.4,0.38,9.66,0.38800000000000001,38.800000000000004,2.2799999999999998,2280,1.49,350,{"$f":"VLOOKUP(U337,'Powder Core Toroid OD'!$A$2:$B$36,2,FALSE)","v":23.6}]
[55350,"C055350A2",350,125,"MPP",105,"Toroid",5.88,58.8,0.54200000000000004,13.7,0.95799999999999996,24.4,0.38,9.66,0.38800000000000001,38.800000000000004,2.2799999999999998,2280,1.49,350,{"$f":"VLOOKUP(U338,'Powder Core Toroid OD'!$A$2:$B$36,2,FALSE)","v":23.6}]
[55351,"C055351A2",350,60,"MPP",51,"Toroid",5.88,58.8,0.54200000000000004,13.7,0.95799999999999996,24.4,0.38,9.66,0.38800000000000001,38.800000000000004,2.2799999999999998,2280,1.49,350,{"$f":"VLOOKUP(U339,'Powder Core Toroid OD'!$A$2:$B$36,2,FALSE)","v":23.6}]
[55352,"0055352A2",350,26,"MPP",22,"Toroid",5.88,58.8,0.54200000000000004,13.7,0.95799999999999996,24.4,0.38,9.66,0.38800000000000001,38.800000000000004,2.2799999999999998,2280,1.49,350,{"$f":"VLOOKUP(U340,'Powder Core Toroid OD'!$A$2:$B$36,2,FALSE)","v":23.6}]
[55353,"0055353A2",350,14,"MPP",12,"Toroid",5.88,58.8,0.54200000000000004,13.7,0.95799999999999996,24.4,0.38,9.66,0.38800000000000001,38.800000000000004,2.2799999999999998,2280,1.49,350,{"$f":"VLOOKUP(U341,'Powder Core Toroid OD'!$A$2:$B$36,2,FALSE)","v":23.6}]
[55374,"C055374A2",380,173,"MPP",123,"Toroid",4.1399999999999997,41.4,0.35499999999999998,9.01,0.71,18.100000000000001,0.28000000000000003,7.12,0.23200000000000001,23.200000000000003,0.96048,960,0.63800000000000001,380,{"$f":"VLOOKUP(U342,'Powder Core Toroid OD'!$A$2:$B$36,2,FALSE)","v":17.3}]
[55375,"C055375A2",380,300,"MPP",214,"Toroid",4.1399999999999997,41.4,0.35499999999999998,9.01,0.71,18.100000000000001,0.28000000000000003,7.12,0.23200000000000001,23.200000000000003,0.96048,960,0.63800000000000001,380,{"$f":"VLOOKUP(U343,'Powder Core Toroid OD'!$A$2:$B$36,2,FALSE)","v":17.3}]
[55377,"C055377A2",380,200,"MPP",142,"Toroid",4.1399999999999997,41.4,0.35499999999999998,9.01,0.71,18.100000000000001,0.28000000000000003,7.12,0.23200000000000001,23.200000000000003,0.96048,960,0.63800000000000001,380,{"$f":"VLOOKUP(U344,'Powder Core Toroid OD'!$A$2:$B$36,2,FALSE)","v":17.3}]
[55378,"C055378A2",380,160,"MPP",114,"Toroid",4.1399999999999997,41.4,0.35499999999999998,9.01,0.71,18.100000000000001,0.28000000000000003,7.12,0.23200000000000001,23.200000000000003,0.96048,960,0.63800000000000001,380,{"$f":"VLOOKUP(U345,'Powder Core Toroid OD'!$A$2:$B$36,2,FALSE)","v":17.3}]
[55379,"C055379A2",380,147,"MPP",105,"Toroid",4.1399999999999997,41.4,0.35499999999999998,9.01,0.71,18.100000000000001,0.28000000000000003,7.12,0.23200000000000001,23.200000000000003,0.96048,960,0.63800000000000001,380,{"$f":"VLOOKUP(U346,'Powder Core Toroid OD'!$A$2:$B$36,2,FALSE)","v":17.3}]
[55380,"C055380A2",380,125,"MPP",89,"Toroid",4.1399999999999997,41.4,0.35499999999999998,9.01,0.71,18.100000000000001,0.28000000000000003,7.12,0.23200000000000001,23.200000000000003,0.96048,960,0.63800000000000001,380,{"$f":"VLOOKUP(U347,'Powder Core Toroid OD'!$A$2:$B$36,2,FALSE)","v":17.3}]
[55381,"C055381A2",380,60,"MPP",43,"Toroid",4.1399999999999997,41.4,0.35499999999999998,9.01,0.71,18.100000000000001,0.28000000000000003,7.12,0.23200000000000001,23.200000000000003,0.96048,960,0.63800000000000001,380,{"$f":"VLOOKUP(U348,'Powder Core Toroid OD'!$A$2:$B$36,2,FALSE)","v":17.3}]
[55382,"0055382A2",380,26,"MPP",19,"Toroid",4.1399999999999997,41.4,0.35499999999999998,9.01,0.71,18.100000000000001,0.28000000000000003,7.12,0.23200000000000001,23.200000000000003,0.96048,960,0.63800000000000001,380,{"$f":"VLOOKUP(U349,'Powder Core Toroid OD'!$A$2:$B$36,2,FALSE)","v":17.3}]
[55383,"0055383A2",380,14,"MPP",10,"Toroid",4.1399999999999997,41.4,0.35499999999999998,9.01,0.71,18.100000000000001,0.28000000000000003,7.12,0.23200000000000001,23.200000000000003,0.96048,960,0.63800000000000001,380,{"$f":"VLOOKUP(U350,'Powder Core Toroid OD'!$A$2:$B$36,2,FALSE)","v":17.3}]
[55404,"C055404A2",410,173,"MPP",95,"Toroid",1.65,16.5,0.13600000000000001,3.45,0.29499999999999998,7.5,0.22500000000000001,5.72,7.2499999999999995E-2,7.2499999999999991,0.12,120,9.35E-2,410,{"$f":"VLOOKUP(U351,'Powder Core Toroid OD'!$A$2:$B$36,2,FALSE)","v":6.86}]
[55405,"C055405A2",410,300,"MPP",166,"Toroid",1.65,16.5,0.13600000000000001,3.45,0.29499999999999998,7.5,0.22500000000000001,5.72,7.2499999999999995E-2,7.2499999999999991,0.12,120,9.35E-2,410,{"$f":"VLOOKUP(U352,'Powder Core Toroid OD'!$A$2:$B$36,2,FALSE)","v":6.86}]
[55407,"C055407A2",410,200,"MPP",112,"Toroid",1.65,16.5,0.13600000000000001,3.45,0.29499999999999998,7.5,0.22500000000000001,5.72,7.2499999999999995E-2,7.2499999999999991,0.12,120,9.35E-2,410,{"$f":"VLOOKUP(U353,'Powder Core Toroid OD'!$A$2:$B$36,2,FALSE)","v":6.86}]
[55408,"C055408A2",410,160,"MPP",89,"Toroid",1.65,16.5,0.13600000000000001,3.45,0.29499999999999998,7.5,0.22500000000000001,5.72,7.2499999999999995E-2,7.2499999999999991,0.12,120,9.35E-2,410,{"$f":"VLOOKUP(U354,'Powder Core Toroid OD'!$A$2:$B$36,2,FALSE)","v":6.86}]
[55409,"C055409A2",410,147,"MPP",81,"Toroid",1.65,16.5,0.13600000000000001,3.45,0.29499999999999998,7.5,0.22500000000000001,5.72,7.2499999999999995E-2,7.2499999999999991,0.12,120,9.35E-2,410,{"$f":"VLOOKUP(U355,'Powder Core Toroid OD'!$A$2:$B$36,2,FALSE)","v":6.86}]
[55410,"C055410A2",410,125,"MPP",70,"Toroid",1.65,16.5,0.13600000000000001,3.45,0.29499999999999998,7.5,0.22500000000000001,5.72,7.2499999999999995E-2,7.2499999999999991,0.12,120,9.35E-2,410,{"$f":"VLOOKUP(U356,'Powder Core Toroid OD'!$A$2:$B$36,2,FALSE)","v":6.86}]
[55411,"C055411A2",410,60,"MPP",33,"Toroid",1.65,16.5,0.13600000000000001,3.45,0.29499999999999998,7.5,0.22500000000000001,5.72,7.2499999999999995E-2,7.2499999999999991,0.12,120,9.35E-2,410,{"$f":"VLOOKUP(U357,'Powder Core Toroid OD'!$A$2:$B$36,2,FALSE)","v":6.86}]
[55432,"C055432A2",438,173,"MPP",390,"Toroid",10.7,107,0.91800000000000004,23.3,1.875,47.63,0.745,19,1.99,199,21.3,21300,4.2699999999999996,438,{"$f":"VLOOKUP(U358,'Powder Core Toroid OD'!$A$2:$B$36,2,FALSE)","v":46.7}]
[55433,"C055433A2",438,300,"MPP",674,"Toroid",10.7,107,0.91800000000000004,23.3,1.875,47.63,0.745,19,1.99,199,21.3,21300,4.2699999999999996,438,{"$f":"VLOOKUP(U359,'Powder Core Toroid OD'!$A$2:$B$36,2,FALSE)","v":46.7}]
[55435,"C055435A2",438,200,"MPP",450,"Toroid",10.7,107,0.91800000000000004,23.3,1.875,47.63,0.745,19,1.99,199,21.3,21300,4.2699999999999996,438,{"$f":"VLOOKUP(U360,'Powder Core Toroid OD'!$A$2:$B$36,2,FALSE)","v":46.7}]
[55436,"C055436A2",438,160,"MPP",360,"Toroid",10.7,107,0.91800000000000004,23.3,1.875,47.63,0.745,19,1.99,199,21.3,21300,4.2699999999999996,438,{"$f":"VLOOKUP(U361,'Powder Core Toroid OD'!$A$2:$B$36,2,FALSE)","v":46.7}]
[55437,"C055437A2",438,147,"MPP",330,"Toroid",10.7,107,0.91800000000000004,23.3,1.875,47.63,0.745,19,1.99,199,21.3,21300,4.2699999999999996,438,{"$f":"VLOOKUP(U362,'Powder Core Toroid OD'!$A$2:$B$36,2,FALSE)","v":46.7}]
[55438,"C055438A2",438,125,"MPP",281,"Toroid",10.7,107,0.91800000000000004,23.3,1.875,47.63,0.745,19,1.99,199,21.3,21300,4.2699999999999996,438,{"$f":"VLOOKUP(U363,'Powder Core Toroid OD'!$A$2:$B$36,2,FALSE)","v":46.7}]
[55439,"C055439A2",438,60,"MPP",135,"Toroid",10.7,107,0.91800000000000004,23.3,1.875,47.63,0.745,19,1.99,199,21.3,21300,4.2699999999999996,438,{"$f":"VLOOKUP(U364,'Powder Core Toroid OD'!$A$2:$B$36,2,FALSE)","v":46.7}]
[55440,"0055440A2",438,26,"MPP",59,"Toroid",10.7,107,0.91800000000000004,23.3,1.875,47.63,0.745,19,1.99,199,21.3,21300,4.2699999999999996,438,{"$f":"VLOOKUP(U365,'Powder Core Toroid OD'!$A$2:$B$36,2,FALSE)","v":46.7}]
[55441,"0055441A2",438,14,"MPP",32,"Toroid",10.7,107,0.91800000000000004,23.3,1.875,47.63,0.745,19,1.99,199,21.3,21300,4.2699999999999996,438,{"$f":"VLOOKUP(U366,'Powder Core Toroid OD'!$A$2:$B$36,2,FALSE)","v":46.7}]
[55542,"C055542A2",548,173,"MPP",176,"Toroid",8.14,81.400000000000006,0.76600000000000001,19.399999999999999,1.325,33.659999999999997,0.45,11.5,0.65600000000000003,65.600000000000009,5.34,5340,2.97,548,{"$f":"VLOOKUP(U367,'Powder Core Toroid OD'!$A$2:$B$36,2,FALSE)","v":32.799999999999997}]
[55543,"C055543A2",548,300,"MPP",305,"Toroid",8.14,81.400000000000006,0.76600000000000001,19.399999999999999,1.325,33.659999999999997,0.45,11.5,0.65600000000000003,65.600000000000009,5.34,5340,2.97,548,{"$f":"VLOOKUP(U368,'Powder Core Toroid OD'!$A$2:$B$36,2,FALSE)","v":32.799999999999997}]
[55544,"C055544A2",548,550,"MPP",559,"Toroid",8.14,81.400000000000006,0.76600000000000001,19.399999999999999,1.325,33.659999999999997,0.45,11.5,0.65600000000000003,65.600000000000009,5.34,5340,2.97,548,{"$f":"VLOOKUP(U369,'Powder Core Toroid OD'!$A$2:$B$36,2,FALSE)","v":32.799999999999997}]
[55545,"C055545A2",548,200,"MPP",203,"Toroid",8.14,81.400000000000006,0.76600000000000001,19.399999999999999,1.325,33.659999999999997,0.45,11.5,0.65600000000000003,65.600000000000009,5.34,5340,2.97,548,{"$f":"VLOOKUP(U370,'Powder Core Toroid OD'!$A$2:$B$36,2,FALSE)","v":32.799999999999997}]
[55546,"C055546A2",548,160,"MPP",163,"Toroid",8.14,81.400000000000006,0.76600000000000001,19.399999999999999,1.325,33.659999999999997,0.45,11.5,0.65600000000000003,65.600000000000009,5.34,5340,2.97,548,{"$f":"VLOOKUP(U371,'Powder Core Toroid OD'!$A$2:$B$36,2,FALSE)","v":32.799999999999997}]
[55547,"C055547A2",548,147,"MPP",150,"Toroid",8.14,81.400000000000006,0.76600000000000001,19.399999999999999,1.325,33.659999999999997,0.45,11.5,0.65600000000000003,65.600000000000009,5.34,5340,2.97,548,{"$f":"VLOOKUP(U372,'Powder Core Toroid OD'!$A$2:$B$36,2,FALSE)","v":32.799999999999997}]
[55548,"C055548A2",548,125,"MPP",127,"Toroid",8.14,81.400000000000006,0.76600000000000001,19.399999999999999,1.325,33.659999999999997,0.45,11.5,0.65600000000000003,65.600000000000009,5.34,5340,2.97,548,{"$f":"VLOOKUP(U373,'Powder Core Toroid OD'!$A$2:$B$36,2,FALSE)","v":32.799999999999997}]
[55550,"0055550A2",548,26,"MPP",28,"Toroid",8.14,81.400000000000006,0.76600000000000001,19.399999999999999,1.325,33.659999999999997,0.45,11.5,0.65600000000000003,65.600000000000009,5.34,5340,2.97,548,{"$f":"VLOOKUP(U374,'Powder Core Toroid OD'!$A$2:$B$36,2,FALSE)","v":32.799999999999997}]
[55551,"0055551A2",548,14,"MPP",14,"Toroid",8.14,81.400000000000006,0.76600000000000001,19.399999999999999,1.325,33.659999999999997,0.45,11.5,0.65600000000000003,65.600000000000009,5.34,5340,2.97,548,{"$f":"VLOOKUP(U375,'Powder Core Toroid OD'!$A$2:$B$36,2,FALSE)","v":32.799999999999997}]
[55579,"C055579A2",585,173,"MPP",109,"Toroid",8.9499999999999993,89.5,0.88800000000000001,22.5,1.385,35.18,0.38500000000000001,9.7799999999999994,0.46400000000000002,46.4,4.1500000000000004,4150,3.99,585,{"$f":"VLOOKUP(U376,'Powder Core Toroid OD'!$A$2:$B$36,2,FALSE)","v":34.299999999999997}]
[55580,"C055580A2",585,300,"MPP",190,"Toroid",8.9499999999999993,89.5,0.88800000000000001,22.5,1.385,35.18,0.38500000000000001,9.7799999999999994,0.46400000000000002,46.4,4.1500000000000004,4150,3.99,585,{"$f":"VLOOKUP(U377,'Powder Core Toroid OD'!$A$2:$B$36,2,FALSE)","v":34.299999999999997}]
[55581,"C055581A2",585,550,"MPP",348,"Toroid",8.9499999999999993,89.5,0.88800000000000001,22.5,1.385,35.18,0.38500000000000001,9.7799999999999994,0.46400000000000002,46.4,4.1500000000000004,4150,3.99,585,{"$f":"VLOOKUP(U378,'Powder Core Toroid OD'!$A$2:$B$36,2,FALSE)","v":34.299999999999997}]
[55582,"C055582A2",585,200,"MPP",126,"Toroid",8.9499999999999993,89.5,0.88800000000000001,22.5,1.385,35.18,0.38500000000000001,9.7799999999999994,0.46400000000000002,46.4,4.1500000000000004,4150,3.99,{"$f":"C379*1","v":585},{"$f":"VLOOKUP(U379,'Powder Core Toroid OD'!$A$2:$B$36,2,FALSE)","v":34.299999999999997}]
[55583,"C055583A2",585,160,"MPP",101,"Toroid",8.9499999999999993,89.5,0.88800000000000001,22.5,1.385,35.18,0.38500000000000001,9.7799999999999994,0.46400000000000002,46.4,4.1500000000000004,4150,3.99,585,{"$f":"VLOOKUP(U380,'Powder Core Toroid OD'!$A$2:$B$36,2,FALSE)","v":34.299999999999997}]
[55585,"C055585A2",585,125,"MPP",79,"Toroid",8.9499999999999993,89.5,0.88800000000000001,22.5,1.385,35.18,0.38500000000000001,9.7799999999999994,0.46400000000000002,46.4,4.1500000000000004,4150,3.99,585,{"$f":"VLOOKUP(U381,'Powder Core Toroid OD'!$A$2:$B$36,2,FALSE)","v":34.299999999999997}]
[55586,"C055586A2",585,60,"MPP",38,"Toroid",8.9499999999999993,89.5,0.88800000000000001,22.5,1.385,35.18,0.38500000000000001,9.7799999999999994,0.46400000000000002,46.4,4.1500000000000004,4150,3.99,585,{"$f":"VLOOKUP(U382,'Powder Core Toroid OD'!$A$2:$B$36,2,FALSE)","v":34.299999999999997}]
[55587,"0055587A2",585,26,"MPP",16,"Toroid",8.9499999999999993,89.5,0.88800000000000001,22.5,1.385,35.18,0.38500000000000001,9.7799999999999994,0.46400000000000002,46.4,4.1500000000000004,4150,3.99,585,{"$f":"VLOOKUP(U383,'Powder Core Toroid OD'!$A$2:$B$36,2,FALSE)","v":34.299999999999997}]
[55588,"0055588A2",585,14,"MPP",9,"Toroid",8.9499999999999993,89.5,0.88800000000000001,22.5,1.385,35.18,0.38500000000000001,9.7799999999999994,0.46400000000000002,46.4,4.1500000000000004,4150,3.99,585,{"$f":"VLOOKUP(U384,'Powder Core Toroid OD'!$A$2:$B$36,2,FALSE)","v":34.299999999999997}]
[55710,"C055710A2",715,300,"MPP",365,"Toroid",12.7,127,1.218,30.93,2.0350000000000001,51.69,0.56500000000000006,14.4,1.25,125,15.9,15900,7.51,715,{"$f":"VLOOKUP(U385,'Powder Core Toroid OD'!$A$2:$B$36,2,FALSE)","v":50.8}]
[55713,"C055713A2",715,160,"MPP",195,"Toroid",12.7,127,1.218,30.93,2.0350000000000001,51.69,0.56500000000000006,14.4,1.25,125,15.9,15900,7.51,715,{"$f":"VLOOKUP(U386,'Powder Core Toroid OD'!$A$2:$B$36,2,FALSE)","v":50.8}]
[55714,"C055714A2",715,147,"MPP",179,"Toroid",12.7,127,1.218,30.93,2.0350000000000001,51.69,0.56500000000000006,14.4,1.25,125,15.9,15900,7.51,715,{"$f":"VLOOKUP(U387,'Powder Core Toroid OD'!$A$2:$B$36,2,FALSE)","v":50.8}]
[55715,"C055715A2",715,125,"MPP",152,"Toroid",12.7,127,1.218,30.93,2.0350000000000001,51.69,0.56500000000000006,14.4,1.25,125,15.9,15900,7.51,715,{"$f":"VLOOKUP(U388,'Powder Core Toroid OD'!$A$2:$B$36,2,FALSE)","v":50.8}]
[55716,"C055716A2",715,60,"MPP",73,"Toroid",12.7,127,1.218,30.93,2.0350000000000001,51.69,0.56500000000000006,14.4,1.25,125,15.9,15900,7.51,715,{"$f":"VLOOKUP(U389,'Powder Core Toroid OD'!$A$2:$B$36,2,FALSE)","v":50.8}]
[55717,"0055717A2",715,26,"MPP",32,"Toroid",12.7,127,1.218,30.93,2.0350000000000001,51.69,0.56500000000000006,14.4,1.25,125,15.9,15900,7.51,715,{"$f":"VLOOKUP(U390,'Powder Core Toroid OD'!$A$2:$B$36,2,FALSE)","v":50.8}]
[55718,"0055718A2",715,14,"MPP",17,"Toroid",12.7,127,1.218,30.93,2.0350000000000001,51.69,0.56500000000000006,14.4,1.25,125,15.9,15900,7.51,715,{"$f":"VLOOKUP(U391,'Powder Core Toroid OD'!$A$2:$B$36,2,FALSE)","v":50.8}]
[55848,"C055848A2",206,60,"MPP",32,"Toroid",5.09,50.9,0.47500000000000003,12,0.83,21.1,0.28000000000000003,7.12,0.221,22.1,1.1200000000000001,1120,1.1399999999999999,206,{"$f":"VLOOKUP(U392,'Powder Core Toroid OD'!$A$2:$B$36,2,FALSE)","v":20.3}]
[55863,"C055863A2",866,200,"MPP",225,"Toroid",19.600000000000001,196,1.8979999999999999,48.2,3.1080000000000001,78.95,0.54500000000000004,13.9,1.76,176,34.5,34500,18.2,866,{"$f":"VLOOKUP(U393,'Powder Core Toroid OD'!$A$2:$B$36,2,FALSE)","v":77.8}]
[55866,"C055866A2",866,125,"MPP",142,"Toroid",19.600000000000001,196,1.8979999999999999,48.2,3.1080000000000001,78.95,0.54500000000000004,13.9,1.76,176,34.5,34500,18.2,866,{"$f":"VLOOKUP(U394,'Powder Core Toroid OD'!$A$2:$B$36,2,FALSE)","v":77.8}]
[55867,"C055867A2",866,60,"MPP",68,"Toroid",19.600000000000001,196,1.8979999999999999,48.2,3.1080000000000001,78.95,0.54500000000000004,13.9,1.76,176,34.5,34500,18.2,866,{"$f":"VLOOKUP(U395,'Powder Core Toroid OD'!$A$2:$B$36,2,FALSE)","v":77.8}]
[55868,"0055868A2",866,26,"MPP",30,"Toroid",19.600000000000001,196,1.8979999999999999,48.2,3.1080000000000001,78.95,0.54500000000000004,13.9,1.76,176,34.5,34500,18.2,866,{"$f":"VLOOKUP(U396,'Powder Core Toroid OD'!$A$2:$B$36,2,FALSE)","v":77.8}]
[55869,"0055869A2",866,14,"MPP",16,"Toroid",19.600000000000001,196,1.8979999999999999,48.2,3.1080000000000001,78.95,0.54500000000000004,13.9,1.76,176,34.5,34500,18.2,866,{"$f":"VLOOKUP(U397,'Powder Core Toroid OD'!$A$2:$B$36,2,FALSE)","v":77.8}]
[55894,"C055894A2",930,60,"MPP",75,"Toroid",6.35,63.5,0.55500000000000005,14.1,1.0900000000000001,27.69,0.47,12,0.65400000000000003,65.400000000000006,4.1500000000000004,4150,1.56,930,{"$f":"VLOOKUP(U398,'Powder Core Toroid OD'!$A$2:$B$36,2,FALSE)","v":26.9}]
[55906,"C055906A2",906,125,"MPP",178,"Toroid",19.600000000000001,196,1.8979999999999999,48.2,3.1080000000000001,78.95,0.67,17.100000000000001,2.21,221,43.4,43400,18.2,906,{"$f":"VLOOKUP(U399,'Powder Core Toroid OD'!$A$2:$B$36,2,FALSE)","v":77.8}]
[55907,"C055907A2",906,60,"MPP",85,"Toroid",19.600000000000001,196,1.8979999999999999,48.2,3.1080000000000001,78.95,0.67,17.100000000000001,2.21,221,43.4,43400,18.2,906,{"$f":"VLOOKUP(U400,'Powder Core Toroid OD'!$A$2:$B$36,2,FALSE)","v":77.8}]
[55908,"0055908A2",906,26,"MPP",37,"Toroid",19.600000000000001,196,1.8979999999999999,48.2,3.1080000000000001,78.95,0.67,17.100000000000001,2.21,221,43.4,43400,18.2,906,{"$f":"VLOOKUP(U401,'Powder Core Toroid OD'!$A$2:$B$36,2,FALSE)","v":77.8}]
[55909,"0055909A2",906,14,"MPP",20,"Toroid",19.600000000000001,196,1.8979999999999999,48.2,3.1080000000000001,78.95,0.67,17.100000000000001,2.21,221,43.4,43400,18.2,906,{"$f":"VLOOKUP(U402,'Powder Core Toroid OD'!$A$2:$B$36,2,FALSE)","v":77.8}]
[55924,"C055924A2",930,173,"MPP",217,"Toroid",6.35,63.5,0.55500000000000005,14.1,1.0900000000000001,27.69,0.47,12,0.65400000000000003,65.400000000000006,4.1500000000000004,4150,1.56,930,{"$f":"VLOOKUP(U403,'Powder Core Toroid OD'!$A$2:$B$36,2,FALSE)","v":26.9}]
[55925,"C055925A2",930,300,"MPP",377,"Toroid",6.35,63.5,0.55500000000000005,14.1,1.0900000000000001,27.69,0.47,12,0.65400000000000003,65.400000000000006,4.1500000000000004,4150,1.56,930,{"$f":"VLOOKUP(U404,'Powder Core Toroid OD'!$A$2:$B$36,2,FALSE)","v":26.9}]
[55926,"C055926A2",930,550,"MPP",740,"Toroid",6.35,63.5,0.55500000000000005,14.1,1.0900000000000001,27.69,0.47,12,0.65400000000000003,65.400000000000006,4.1500000000000004,4150,1.56,930,{"$f":"VLOOKUP(U405,'Powder Core Toroid OD'!$A$2:$B$36,2,FALSE)","v":26.9}]
[55927,"C055927A2",930,200,"MPP",251,"Toroid",6.35,63.5,0.55500000000000005,14.1,1.0900000000000001,27.69,0.47,12,0.65400000000000003,65.400000000000006,4.1500000000000004,4150,1.56,930,{"$f":"VLOOKUP(U406,'Powder Core Toroid OD'!$A$2:$B$36,2,FALSE)","v":26.9}]
[55928,"C055928A2",930,160,"MPP",201,"Toroid",6.35,63.5,0.55500000000000005,14.1,1.0900000000000001,27.69,0.47,12,0.65400000000000003,65.400000000000006,4.1500000000000004,4150,1.56,930,{"$f":"VLOOKUP(U407,'Powder Core Toroid OD'!$A$2:$B$36,2,FALSE)","v":26.9}]
[55929,"C055929A2",930,147,"MPP",185,"Toroid",6.35,63.5,0.55500000000000005,14.1,1.0900000000000001,27.69,0.47,12,0.65400000000000003,65.400000000000006,4.1500000000000004,4150,1.56,930,{"$f":"VLOOKUP(U408,'Powder Core Toroid OD'!$A$2:$B$36,2,FALSE)","v":26.9}]
[55930,"C055930A2",930,125,"MPP",157,"Toroid",6.35,63.5,0.55500000000000005,14.1,1.0900000000000001,27.69,0.47,12,0.65400000000000003,65.400000000000006,4.1500000000000004,4150,1.56,930,{"$f":"VLOOKUP(U409,'Powder Core Toroid OD'!$A$2:$B$36,2,FALSE)","v":26.9}]
[55932,"0055932A2",930,26,"MPP",32,"Toroid",6.35,63.5,0.55500000000000005,14.1,1.0900000000000001,27.69,0.47,12,0.65400000000000003,65.400000000000006,4.1500000000000004,4150,1.56,930,{"$f":"VLOOKUP(U410,'Powder Core Toroid OD'!$A$2:$B$36,2,FALSE)","v":26.9}]
[55933,"0055933A2",930,14,"MPP",18,"Toroid",6.35,63.5,0.55500000000000005,14.1,1.0900000000000001,27.69,0.47,12,0.65400000000000003,65.400000000000006,4.1500000000000004,4150,1.56,930,{"$f":"VLOOKUP(U411,'Powder Core Toroid OD'!$A$2:$B$36,2,FALSE)","v":26.9}]
[58018,"C058018A2","020",160,"High Flux",64,"Toroid",1.36,13.6,0.09,2.2799999999999998,0.27500000000000002,6.99,0.13500000000000001,3.43,4.7E-2,4.7,6.4000000000000001E-2,64,4.0800000000000003E-2,20,{"$f":"VLOOKUP(U412,'Powder Core Toroid OD'!$A$2:$B$36,2,FALSE)","v":6.35}]
[58019,"C058019A2","020",147,"High Flux",59,"Toroid",1.36,13.6,0.09,2.2799999999999998,0.27500000000000002,6.99,0.13500000000000001,3.43,4.7E-2,4.7,6.4000000000000001E-2,64,4.0800000000000003E-2,20,{"$f":"VLOOKUP(U413,'Powder Core Toroid OD'!$A$2:$B$36,2,FALSE)","v":6.35}]
[58020,"C058020A2","020",125,"High Flux",50,"Toroid",1.36,13.6,0.09,2.2799999999999998,0.27500000000000002,6.99,0.13500000000000001,3.43,4.7E-2,4.7,6.4000000000000001E-2,64,4.0800000000000003E-2,20,{"$f":"VLOOKUP(U414,'Powder Core Toroid OD'!$A$2:$B$36,2,FALSE)","v":6.35}]
[58021,"C058021A2","020",60,"High Flux",24,"Toroid",1.36,13.6,0.09,2.2799999999999998,0.27500000000000002,6.99,0.13500000000000001,3.43,4.7E-2,4.7,6.4000000000000001E-2,64,4.0800000000000003E-2,20,{"$f":"VLOOKUP(U415,'Powder Core Toroid OD'!$A$2:$B$36,2,FALSE)","v":6.35}]
[58023,"0058023A2","020",14,"High Flux",6,"Toroid",1.36,13.6,0.09,2.2799999999999998,0.27500000000000002,6.99,0.13500000000000001,3.43,4.7E-2,4.7,6.4000000000000001E-2,64,4.0800000000000003E-2,20,{"$f":"VLOOKUP(U416,'Powder Core Toroid OD'!$A$2:$B$36,2,FALSE)","v":6.35}]
[58028,"C058028A2","030",160,"High Flux",66,"Toroid",1.79,17.899999999999999,0.13600000000000001,3.45,0.33500000000000002,8.51,0.15,3.8099999999999996,5.9900000000000002E-2,5.99,0.107,107,9.35E-2,30,{"$f":"VLOOKUP(U417,'Powder Core Toroid OD'!$A$2:$B$36,2,FALSE)","v":7.87}]
[58029,"C058029A2","030",147,"High Flux",62,"Toroid",1.79,17.899999999999999,0.13600000000000001,3.45,0.33500000000000002,8.51,0.15,3.8099999999999996,5.9900000000000002E-2,5.99,0.107,107,9.35E-2,30,{"$f":"VLOOKUP(U418,'Powder Core Toroid OD'!$A$2:$B$36,2,FALSE)","v":7.87}]
[58030,"C058030A2","030",125,"High Flux",52,"Toroid",1.79,17.899999999999999,0.13600000000000001,3.45,0.33500000000000002,8.51,0.15,3.8099999999999996,5.9900000000000002E-2,5.99,0.107,107,9.35E-2,30,{"$f":"VLOOKUP(U419,'Powder Core Toroid OD'!$A$2:$B$36,2,FALSE)","v":7.87}]
[58031,"C058031A2","030",60,"High Flux",25,"Toroid",1.79,17.899999999999999,0.13600000000000001,3.45,0.33500000000000002,8.51,0.15,3.8099999999999996,5.9900000000000002E-2,5.99,0.107,107,9.35E-2,30,{"$f":"VLOOKUP(U420,'Powder Core Toroid OD'!$A$2:$B$36,2,FALSE)","v":7.87}]
[58032,"0058032A2","030",26,"High Flux",11,"Toroid",1.79,17.899999999999999,0.13600000000000001,3.45,0.33500000000000002,8.51,0.15,3.8099999999999996,5.9900000000000002E-2,5.99,0.107,107,9.35E-2,30,{"$f":"VLOOKUP(U421,'Powder Core Toroid OD'!$A$2:$B$36,2,FALSE)","v":7.87}]
[58033,"0058033A2","030",14,"High Flux",6,"Toroid",1.79,17.899999999999999,0.13600000000000001,3.45,0.33500000000000002,8.51,0.15,3.8099999999999996,5.9900000000000002E-2,5.99,0.107,107,9.35E-2,30,{"$f":"VLOOKUP(U422,'Powder Core Toroid OD'!$A$2:$B$36,2,FALSE)","v":7.87}]
[58038,"C058038A2","040",160,"High Flux",84,"Toroid",2.2999999999999998,23,0.18,4.57,0.42499999999999999,10.8,0.18099999999999999,4.5999999999999996,9.5699999999999993E-2,9.5699999999999985,0.22,220,0.16400000000000001,40,{"$f":"VLOOKUP(U423,'Powder Core Toroid OD'!$A$2:$B$36,2,FALSE)","v":10.199999999999999}]
[58039,"C058039A2","040",147,"High Flux",78,"Toroid",2.2999999999999998,23,0.18,4.57,0.42499999999999999,10.8,0.18099999999999999,4.5999999999999996,9.5699999999999993E-2,9.5699999999999985,0.22,220,0.16400000000000001,40,{"$f":"VLOOKUP(U424,'Powder Core Toroid OD'!$A$2:$B$36,2,FALSE)","v":10.199999999999999}]
[58040,"C058040A2","040",125,"High Flux",66,"Toroid",2.2999999999999998,23,0.18,4.57,0.42499999999999999,10.8,0.18099999999999999,4.5999999999999996,9.5699999999999993E-2,9.5699999999999985,0.22,220,0.16400000000000001,40,{"$f":"VLOOKUP(U425,'Powder Core Toroid OD'!$A$2:$B$36,2,FALSE)","v":10.199999999999999}]
[58041,"C058041A2","040",60,"High Flux",32,"Toroid",2.2999999999999998,23,0.18,4.57,0.42499999999999999,10.8,0.18099999999999999,4.5999999999999996,9.5699999999999993E-2,9.5699999999999985,0.22,220,0.16400000000000001,40,{"$f":"VLOOKUP(U426,'Powder Core Toroid OD'!$A$2:$B$36,2,FALSE)","v":10.199999999999999}]
[58042,"0058042A2","040",26,"High Flux",14,"Toroid",2.2999999999999998,23,0.18,4.57,0.42499999999999999,10.8,0.18099999999999999,4.5999999999999996,9.5699999999999993E-2,9.5699999999999985,0.22,220,0.16400000000000001,40,{"$f":"VLOOKUP(U427,'Powder Core Toroid OD'!$A$2:$B$36,2,FALSE)","v":10.199999999999999}]
[58048,"C058048A2","050",160,"High Flux",72,"Toroid",3.12,31.200000000000003,0.27500000000000002,6.98,0.53,13.5,0.217,5.52,0.109,10.9,0.34,340,0.38300000000000001,50,{"$f":"VLOOKUP(U428,'Powder Core Toroid OD'!$A$2:$B$36,2,FALSE)","v":12.7}]
[58049,"C058049A2","050",147,"High Flux",67,"Toroid",3.12,31.200000000000003,0.27500000000000002,6.98,0.53,13.5,0.217,5.52,0.109,10.9,0.34,340,0.38300000000000001,50,{"$f":"VLOOKUP(U429,'Powder Core Toroid OD'!$A$2:$B$36,2,FALSE)","v":12.7}]
[58050,"C058050A2","050",125,"High Flux",56,"Toroid",3.12,31.200000000000003,0.27500000000000002,6.98,0.53,13.5,0.217,5.52,0.109,10.9,0.34,340,0.38300000000000001,50,{"$f":"VLOOKUP(U430,'Powder Core Toroid OD'!$A$2:$B$36,2,FALSE)","v":12.7}]
[58051,"C058051A2","050",60,"High Flux",27,"Toroid",3.12,31.200000000000003,0.27500000000000002,6.98,0.53,13.5,0.217,5.52,0.109,10.9,0.34,340,0.38300000000000001,50,{"$f":"VLOOKUP(U431,'Powder Core Toroid OD'!$A$2:$B$36,2,FALSE)","v":12.7}]
[58052,"0058052A2","050",26,"High Flux",12,"Toroid",3.12,31.200000000000003,0.27500000000000002,6.98,0.53,13.5,0.217,5.52,0.109,10.9,0.34,340,0.38300000000000001,50,{"$f":"VLOOKUP(U432,'Powder Core Toroid OD'!$A$2:$B$36,2,FALSE)","v":12.7}]
[58053,"0058053A2","050",14,"High Flux",6.4,"Toroid",3.12,31.200000000000003,0.27500000000000002,6.98,0.53,13.5,0.217,5.52,0.109,10.9,0.34,340,0.38300000000000001,50,{"$f":"VLOOKUP(U433,'Powder Core Toroid OD'!$A$2:$B$36,2,FALSE)","v":12.7}]
[58059,"C058059A2",310,60,"High Flux",43,"Toroid",5.67,56.7,0.52500000000000002,13.3,0.93,23.7,0.33,8.39,0.317,31.7,1.8,1800,1.39,310,{"$f":"VLOOKUP(U434,'Powder Core Toroid OD'!$A$2:$B$36,2,FALSE)","v":22.9}]
[58071,"C058071A2",548,60,"High Flux",61,"Toroid",8.14,81.400000000000006,0.76600000000000001,19.399999999999999,1.325,33.659999999999997,0.45,11.5,0.65600000000000003,65.600000000000009,5.34,5340,2.97,548,{"$f":"VLOOKUP(U435,'Powder Core Toroid OD'!$A$2:$B$36,2,FALSE)","v":32.799999999999997}]
[58076,"C058076A2",324,60,"High Flux",56,"Toroid",8.98,89.800000000000011,0.84799999999999998,21.5,1.4450000000000001,36.71,0.44700000000000001,11.4,0.67800000000000005,67.800000000000011,6.09,6090,3.64,324,{"$f":"VLOOKUP(U436,'Powder Core Toroid OD'!$A$2:$B$36,2,FALSE)","v":35.799999999999997}]
[58083,"C058083A2",254,60,"High Flux",81,"Toroid",9.84,98.4,0.91800000000000004,23.3,1.605,40.770000000000003,0.60499999999999998,15.4,1.07,107,10.6,10600,4.2699999999999996,254,{"$f":"VLOOKUP(U437,'Powder Core Toroid OD'!$A$2:$B$36,2,FALSE)","v":39.9}]
[58089,"C058089A2","089",125,"High Flux",178,"Toroid",11.6,116,1.0980000000000001,27.88,1.875,47.63,0.63500000000000001,16.100000000000001,1.34,134,15.6,15600,6.1,89,{"$f":"VLOOKUP(U438,'Powder Core Toroid OD'!$A$2:$B$36,2,FALSE)","v":46.7}]
[58090,"C058090A2","089",60,"High Flux",86,"Toroid",11.6,116,1.0980000000000001,27.88,1.875,47.63,0.63500000000000001,16.100000000000001,1.34,134,15.6,15600,6.1,89,{"$f":"VLOOKUP(U439,'Powder Core Toroid OD'!$A$2:$B$36,2,FALSE)","v":46.7}]
[58091,"0058091A2","089",26,"High Flux",37,"Toroid",11.6,116,1.0980000000000001,27.88,1.875,47.63,0.63500000000000001,16.100000000000001,1.34,134,15.6,15600,6.1,89,{"$f":"VLOOKUP(U440,'Powder Core Toroid OD'!$A$2:$B$36,2,FALSE)","v":46.7}]
[58092,"0058092A2","089",14,"High Flux",20,"Toroid",11.6,116,1.0980000000000001,27.88,1.875,47.63,0.63500000000000001,16.100000000000001,1.34,134,15.6,15600,6.1,89,{"$f":"VLOOKUP(U441,'Powder Core Toroid OD'!$A$2:$B$36,2,FALSE)","v":46.7}]
[58109,"C058109A2",109,125,"High Flux",156,"Toroid",14.3,143,1.3680000000000001,34.74,2.2850000000000001,58.04,0.58499999999999996,14.9,1.44,144,20.7,20700,9.48,109,{"$f":"VLOOKUP(U442,'Powder Core Toroid OD'!$A$2:$B$36,2,FALSE)","v":57.2}]
[58110,"C058110A2",109,60,"High Flux",75,"Toroid",14.3,143,1.3680000000000001,34.74,2.2850000000000001,58.04,0.58499999999999996,14.9,1.44,144,20.7,20700,9.48,{"$f":"C443*1","v":109},{"$f":"VLOOKUP(U443,'Powder Core Toroid OD'!$A$2:$B$36,2,FALSE)","v":57.2}]
[58111,"0058111A2",109,26,"High Flux",33,"Toroid",14.3,143,1.3680000000000001,34.74,2.2850000000000001,58.04,0.58499999999999996,14.9,1.44,144,20.7,20700,9.48,109,{"$f":"VLOOKUP(U444,'Powder Core Toroid OD'!$A$2:$B$36,2,FALSE)","v":57.2}]
[58112,"0058112A2",109,14,"High Flux",18,"Toroid",14.3,143,1.3680000000000001,34.747199999999999,2.2850000000000001,58.039000000000001,0.58499999999999996,14.858999999999998,1.43,143,20.65,20650,9.48,109,{"$f":"VLOOKUP(U445,'Powder Core Toroid OD'!$A$2:$B$36,2,FALSE)","v":57.2}]
[58118,"C058118A2",120,160,"High Flux",92,"Toroid",4.12,41.2,0.375,9.52,0.68,17.3,0.28000000000000003,7.12,0.192,19.2,0.79100000000000004,791,0.71199999999999997,120,{"$f":"VLOOKUP(U446,'Powder Core Toroid OD'!$A$2:$B$36,2,FALSE)","v":16.600000000000001}]
[58119,"C058119A2",120,147,"High Flux",88,"Toroid",4.12,41.2,0.375,9.52,0.68,17.3,0.28000000000000003,7.12,0.192,19.2,0.79100000000000004,791,0.71199999999999997,120,{"$f":"VLOOKUP(U447,'Powder Core Toroid OD'!$A$2:$B$36,2,FALSE)","v":16.600000000000001}]
[58120,"C058120A2",120,125,"High Flux",72,"Toroid",4.12,41.2,0.375,9.52,0.68,17.3,0.28000000000000003,7.12,0.192,19.2,0.79100000000000004,791,0.71199999999999997,120,{"$f":"VLOOKUP(U448,'Powder Core Toroid OD'!$A$2:$B$36,2,FALSE)","v":16.600000000000001}]
[58121,"C058121A2",120,60,"High Flux",35,"Toroid",4.12,41.2,0.375,9.52,0.68,17.3,0.28000000000000003,7.12,0.192,19.2,0.79100000000000004,791,0.71199999999999997,120,{"$f":"VLOOKUP(U449,'Powder Core Toroid OD'!$A$2:$B$36,2,FALSE)","v":16.600000000000001}]
[58122,"0058122A2",120,26,"High Flux",15,"Toroid",4.12,41.2,0.375,9.52,0.68,17.3,0.28000000000000003,7.12,0.192,19.2,0.79100000000000004,791,0.71199999999999997,120,{"$f":"VLOOKUP(U450,'Powder Core Toroid OD'!$A$2:$B$36,2,FALSE)","v":16.600000000000001}]
[58123,"0058123A2",120,14,"High Flux",8,"Toroid",4.12,41.2,0.375,9.52,0.68,17.3,0.28000000000000003,7.12,0.192,19.2,0.79100000000000004,791,0.71199999999999997,120,{"$f":"VLOOKUP(U451,'Powder Core Toroid OD'!$A$2:$B$36,2,FALSE)","v":16.600000000000001}]
[58128,"C058128A2",130,160,"High Flux",68,"Toroid",2.69,26.9,0.23,5.84,0.46500000000000002,11.9,0.18099999999999999,4.5999999999999996,9.06E-2,9.06,0.24399999999999999,244,0.26800000000000002,130,{"$f":"VLOOKUP(U452,'Powder Core Toroid OD'!$A$2:$B$36,2,FALSE)","v":11.2}]
[58129,"C058129A2",130,147,"High Flux",63,"Toroid",2.69,26.9,0.23,5.84,0.46500000000000002,11.9,0.18099999999999999,4.5999999999999996,9.06E-2,9.06,0.24399999999999999,244,0.26800000000000002,130,{"$f":"VLOOKUP(U453,'Powder Core Toroid OD'!$A$2:$B$36,2,FALSE)","v":11.2}]
[58130,"C058130A2",130,125,"High Flux",53,"Toroid",2.69,26.9,0.23,5.84,0.46500000000000002,11.9,0.18099999999999999,4.5999999999999996,9.06E-2,9.06,0.24399999999999999,244,0.26800000000000002,130,{"$f":"VLOOKUP(U454,'Powder Core Toroid OD'!$A$2:$B$36,2,FALSE)","v":11.2}]
[58131,"C058131A2",130,60,"High Flux",26,"Toroid",2.69,26.9,0.23,5.84,0.46500000000000002,11.9,0.18099999999999999,4.5999999999999996,9.06E-2,9.06,0.24399999999999999,244,0.26800000000000002,130,{"$f":"VLOOKUP(U455,'Powder Core Toroid OD'!$A$2:$B$36,2,FALSE)","v":11.2}]
[58132,"0058132A2",130,26,"High Flux",11,"Toroid",2.69,26.9,0.23,5.84,0.46500000000000002,11.9,0.18099999999999999,4.5999999999999996,9.06E-2,9.06,0.24399999999999999,244,0.26800000000000002,130,{"$f":"VLOOKUP(U456,'Powder Core Toroid OD'!$A$2:$B$36,2,FALSE)","v":11.2}]
[58133,"0058133A2",130,14,"High Flux",6,"Toroid",2.69,26.9,0.23,5.84,0.46500000000000002,11.9,0.18099999999999999,4.5999999999999996,9.06E-2,9.06,0.24399999999999999,244,0.26800000000000002,130,{"$f":"VLOOKUP(U457,'Powder Core Toroid OD'!$A$2:$B$36,2,FALSE)","v":11.2}]
[58150,"C058150A2",150,125,"High Flux",35,"Toroid",0.94199999999999995,9.42,6.8000000000000005E-2,1.72,0.18,4.58,0.125,3.18,2.1100000000000001E-2,2.11,1.9900000000000001E-2,19.899999999999999,2.3199999999999998E-2,150,{"$f":"VLOOKUP(U458,'Powder Core Toroid OD'!$A$2:$B$36,2,FALSE)","v":3.94}]
[58181,"C058181A2",180,60,"High Flux",20,"Toroid",1.06,10.6,7.2999999999999995E-2,1.85,0.20799999999999999,5.29,0.125,3.18,2.8500000000000001E-2,2.85,3.0300000000000001E-2,30.3,2.69E-2,180,{"$f":"VLOOKUP(U459,'Powder Core Toroid OD'!$A$2:$B$36,2,FALSE)","v":4.6500000000000004}]
[58190,"0058190A2",195,14,"High Flux",32,"Toroid",12.5,125,1.0069999999999999,25.57,2.2850000000000001,58.04,0.63500000000000001,16.2,2.29,229,28.6,28600,5.14,195,{"$f":"VLOOKUP(U460,'Powder Core Toroid OD'!$A$2:$B$36,2,FALSE)","v":57.2}]
[58191,"0058191A2",195,26,"High Flux",60,"Toroid",12.5,125,1.0069999999999999,25.57,2.2850000000000001,58.04,0.63500000000000001,16.2,2.29,229,28.6,28600,5.14,195,{"$f":"VLOOKUP(U461,'Powder Core Toroid OD'!$A$2:$B$36,2,FALSE)","v":57.2}]
[58192,"C058192A2",195,60,"High Flux",138,"Toroid",12.5,125,1.0069999999999999,25.57,2.2850000000000001,58.04,0.63500000000000001,16.2,2.29,229,28.6,28600,5.14,195,{"$f":"VLOOKUP(U462,'Powder Core Toroid OD'!$A$2:$B$36,2,FALSE)","v":57.2}]
[58195,"C058195A2",195,125,"High Flux",287,"Toroid",12.5,125,1.0069999999999999,25.57,2.2850000000000001,58.04,0.63500000000000001,16.2,2.29,229,28.6,28600,5.14,195,{"$f":"VLOOKUP(U463,'Powder Core Toroid OD'!$A$2:$B$36,2,FALSE)","v":57.2}]
[58204,"C058204A2",206,160,"High Flux",87,"Toroid",5.09,50.9,0.47500000000000003,12,0.83,21.1,0.28000000000000003,7.12,0.221,22.1,1.1200000000000001,1120,1.1399999999999999,206,{"$f":"VLOOKUP(U464,'Powder Core Toroid OD'!$A$2:$B$36,2,FALSE)","v":20.3}]
[58205,"C058205A2",206,147,"High Flux",81,"Toroid",5.09,50.9,0.47500000000000003,12,0.83,21.1,0.28000000000000003,7.12,0.221,22.1,1.1200000000000001,1120,1.1399999999999999,206,{"$f":"VLOOKUP(U465,'Powder Core Toroid OD'!$A$2:$B$36,2,FALSE)","v":20.3}]
[58206,"C058206A2",206,125,"High Flux",68,"Toroid",5.09,50.9,0.47500000000000003,12,0.83,21.1,0.28000000000000003,7.12,0.221,22.1,1.1200000000000001,1120,1.1399999999999999,206,{"$f":"VLOOKUP(U466,'Powder Core Toroid OD'!$A$2:$B$36,2,FALSE)","v":20.3}]
[58208,"0058208A2",206,26,"High Flux",14,"Toroid",5.09,50.9,0.47500000000000003,12,0.83,21.1,0.28000000000000003,7.12,0.221,22.1,1.1200000000000001,1120,1.1399999999999999,206,{"$f":"VLOOKUP(U467,'Powder Core Toroid OD'!$A$2:$B$36,2,FALSE)","v":20.3}]
[58209,"0058209A2",206,14,"High Flux",7.8,"Toroid",5.09,50.9,0.47500000000000003,12,0.83,21.1,0.28000000000000003,7.12,0.221,22.1,1.1200000000000001,1120,1.1399999999999999,206,{"$f":"VLOOKUP(U468,'Powder Core Toroid OD'!$A$2:$B$36,2,FALSE)","v":20.3}]
[58238,"C058238A2",240,160,"High Flux",69,"Toroid",1.36,13.6,8.5000000000000006E-2,2.15,0.28499999999999998,7.24,0.125,3.18,4.7600000000000003E-2,4.7600000000000007,6.4899999999999999E-2,64.900000000000006,3.6299999999999999E-2,240,{"$f":"VLOOKUP(U469,'Powder Core Toroid OD'!$A$2:$B$36,2,FALSE)","v":6.6}]
[58239,"C058239A2",240,147,"High Flux",64,"Toroid",1.36,13.6,8.5000000000000006E-2,2.15,0.28499999999999998,7.24,0.125,3.18,4.7600000000000003E-2,4.7600000000000007,6.4899999999999999E-2,64.900000000000006,3.6299999999999999E-2,240,{"$f":"VLOOKUP(U470,'Powder Core Toroid OD'!$A$2:$B$36,2,FALSE)","v":6.6}]
[58240,"C058240A2",240,125,"High Flux",54,"Toroid",1.36,13.6,8.5000000000000006E-2,2.15,0.28499999999999998,7.24,0.125,3.18,4.7600000000000003E-2,4.7600000000000007,6.4899999999999999E-2,64.900000000000006,3.6299999999999999E-2,240,{"$f":"VLOOKUP(U471,'Powder Core Toroid OD'!$A$2:$B$36,2,FALSE)","v":6.6}]
[58241,"C058241A2",240,60,"High Flux",26,"Toroid",1.36,13.6,8.5000000000000006E-2,2.15,0.28499999999999998,7.24,0.125,3.18,4.7600000000000003E-2,4.7600000000000007,6.4899999999999999E-2,64.900000000000006,3.6299999999999999E-2,240,{"$f":"VLOOKUP(U472,'Powder Core Toroid OD'!$A$2:$B$36,2,FALSE)","v":6.6}]
[58243,"0058243A2",240,14,"High Flux",6,"Toroid",1.36,13.6,8.5000000000000006E-2,2.15,0.28499999999999998,7.24,0.125,3.18,4.7600000000000003E-2,4.7600000000000007,6.4899999999999999E-2,64.900000000000006,3.6299999999999999E-2,240,{"$f":"VLOOKUP(U473,'Powder Core Toroid OD'!$A$2:$B$36,2,FALSE)","v":6.6}]
[58252,"C058252A2",254,160,"High Flux",215,"Toroid",9.84,98.4,0.91800000000000004,23.3,1.605,40.770000000000003,0.60499999999999998,15.4,1.07,107,10.6,10600,4.2699999999999996,254,{"$f":"VLOOKUP(U474,'Powder Core Toroid OD'!$A$2:$B$36,2,FALSE)","v":39.9}]
[58253,"C058253A2",254,147,"High Flux",198,"Toroid",9.84,98.4,0.91800000000000004,23.3,1.605,40.770000000000003,0.60499999999999998,15.4,1.07,107,10.6,10600,4.2699999999999996,254,{"$f":"VLOOKUP(U475,'Powder Core Toroid OD'!$A$2:$B$36,2,FALSE)","v":39.9}]
[58254,"C058254A2",254,125,"High Flux",168,"Toroid",9.84,98.4,0.91800000000000004,23.3,1.605,40.770000000000003,0.60499999999999998,15.4,1.07,107,10.6,10600,4.2699999999999996,254,{"$f":"VLOOKUP(U476,'Powder Core Toroid OD'!$A$2:$B$36,2,FALSE)","v":39.9}]
[58256,"0058256A2",254,26,"High Flux",35,"Toroid",9.84,98.4,0.91800000000000004,23.3,1.605,40.770000000000003,0.60499999999999998,15.4,1.07,107,10.6,10600,4.2699999999999996,254,{"$f":"VLOOKUP(U477,'Powder Core Toroid OD'!$A$2:$B$36,2,FALSE)","v":39.9}]
[58257,"0058257A2",254,14,"High Flux",19,"Toroid",9.84,98.4,0.91800000000000004,23.3,1.605,40.770000000000003,0.60499999999999998,15.4,1.07,107,10.6,10600,4.2699999999999996,254,{"$f":"VLOOKUP(U478,'Powder Core Toroid OD'!$A$2:$B$36,2,FALSE)","v":39.9}]
[58268,"C058268A2",270,160,"High Flux",132,"Toroid",1.36,13.6,8.5000000000000006E-2,2.15,0.28500000000000003,7.24,0.21299999999999999,5.42,9.1999999999999998E-2,9.1999999999999993,0.125,125,3.6299999999999999E-2,270,{"$f":"VLOOKUP(U479,'Powder Core Toroid OD'!$A$2:$B$36,2,FALSE)","v":6.6}]
[58270,"C058270A2",270,125,"High Flux",103,"Toroid",1.36,13.6,8.5000000000000006E-2,2.15,0.28500000000000003,7.24,0.21299999999999999,5.42,9.1999999999999998E-2,9.1999999999999993,0.125,125,3.6299999999999999E-2,270,{"$f":"VLOOKUP(U480,'Powder Core Toroid OD'!$A$2:$B$36,2,FALSE)","v":6.6}]
[58271,"C058271A2",270,60,"High Flux",50,"Toroid",1.36,13.6,8.5000000000000006E-2,2.15,0.28500000000000003,7.24,0.21299999999999999,5.42,9.1999999999999998E-2,9.1999999999999993,0.125,125,3.6299999999999999E-2,270,{"$f":"VLOOKUP(U481,'Powder Core Toroid OD'!$A$2:$B$36,2,FALSE)","v":6.6}]
[58273,"0058273A2",270,14,"High Flux",12,"Toroid",1.36,13.6,8.5000000000000006E-2,2.15,0.28500000000000003,7.24,0.21299999999999999,5.42,9.1999999999999998E-2,9.1999999999999993,0.125,125,3.6299999999999999E-2,270,{"$f":"VLOOKUP(U482,'Powder Core Toroid OD'!$A$2:$B$36,2,FALSE)","v":6.6}]
[58278,"C058278A2",280,160,"High Flux",68,"Toroid",2.1800000000000002,21.8,0.16800000000000001,4.26,0.40500000000000003,10.3,0.15,3.8099999999999996,7.5200000000000003E-2,7.52,0.16400000000000001,164,0.14299999999999999,280,{"$f":"VLOOKUP(U483,'Powder Core Toroid OD'!$A$2:$B$36,2,FALSE)","v":9.65}]
[58279,"C058279A2",280,147,"High Flux",63,"Toroid",2.1800000000000002,21.8,0.16800000000000001,4.26,0.40500000000000003,10.3,0.15,3.8099999999999996,7.5200000000000003E-2,7.52,0.16400000000000001,164,0.14299999999999999,280,{"$f":"VLOOKUP(U484,'Powder Core Toroid OD'!$A$2:$B$36,2,FALSE)","v":9.65}]
[58280,"C058280A2",280,125,"High Flux",53,"Toroid",2.1800000000000002,21.8,0.16800000000000001,4.26,0.40500000000000003,10.3,0.15,3.8099999999999996,7.5200000000000003E-2,7.52,0.16400000000000001,164,0.14299999999999999,280,{"$f":"VLOOKUP(U485,'Powder Core Toroid OD'!$A$2:$B$36,2,FALSE)","v":9.65}]
[58281,"C058281A2",280,60,"High Flux",25,"Toroid",2.1800000000000002,21.8,0.16800000000000001,4.26,0.40500000000000003,10.3,0.15,3.8099999999999996,7.5200000000000003E-2,7.52,0.16400000000000001,164,0.14299999999999999,280,{"$f":"VLOOKUP(U486,'Powder Core Toroid OD'!$A$2:$B$36,2,FALSE)","v":9.65}]
[58282,"0058282A2",280,26,"High Flux",11,"Toroid",2.1800000000000002,21.8,0.16800000000000001,4.26,0.40500000000000003,10.3,0.15,3.8099999999999996,7.5200000000000003E-2,7.52,0.16400000000000001,164,0.14299999999999999,280,{"$f":"VLOOKUP(U487,'Powder Core Toroid OD'!$A$2:$B$36,2,FALSE)","v":9.65}]
[58288,"C058288A2",290,160,"High Flux",84,"Toroid",2.1800000000000002,21.8,0.16800000000000001,4.26,0.40500000000000003,10.3,0.18099999999999999,4.5999999999999996,9.4500000000000001E-2,9.4499999999999993,0.20599999999999999,206,0.14299999999999999,290,{"$f":"VLOOKUP(U488,'Powder Core Toroid OD'!$A$2:$B$36,2,FALSE)","v":9.65}]
[58289,"C058289A2",290,147,"High Flux",78,"Toroid",2.1800000000000002,21.8,0.16800000000000001,4.26,0.40500000000000003,10.3,0.18099999999999999,4.5999999999999996,9.4500000000000001E-2,9.4499999999999993,0.20599999999999999,206,0.14299999999999999,290,{"$f":"VLOOKUP(U489,'Powder Core Toroid OD'!$A$2:$B$36,2,FALSE)","v":9.65}]
[58290,"C058290A2",290,125,"High Flux",66,"Toroid",2.1800000000000002,21.8,0.16800000000000001,4.26,0.40500000000000003,10.3,0.18099999999999999,4.5999999999999996,9.4500000000000001E-2,9.4499999999999993,0.20599999999999999,206,0.14299999999999999,290,{"$f":"VLOOKUP(U490,'Powder Core Toroid OD'!$A$2:$B$36,2,FALSE)","v":9.65}]
[58291,"C058291A2",290,60,"High Flux",32,"Toroid",2.1800000000000002,21.8,0.16800000000000001,4.26,0.40500000000000003,10.3,0.18099999999999999,4.5999999999999996,9.4500000000000001E-2,9.4499999999999993,0.20599999999999999,206,0.14299999999999999,290,{"$f":"VLOOKUP(U491,'Powder Core Toroid OD'!$A$2:$B$36,2,FALSE)","v":9.65}]
[58292,"0058292A2",290,26,"High Flux",14,"Toroid",2.1800000000000002,21.8,0.16800000000000001,4.26,0.40500000000000003,10.3,0.18099999999999999,4.5999999999999996,9.4500000000000001E-2,9.4499999999999993,0.20599999999999999,206,0.14299999999999999,290,{"$f":"VLOOKUP(U492,'Powder Core Toroid OD'!$A$2:$B$36,2,FALSE)","v":9.65}]
[58293,"0058293A2",290,14,"High Flux",7,"Toroid",2.1800000000000002,21.8,0.16800000000000001,4.26,0.40500000000000003,10.3,0.18099999999999999,4.5999999999999996,9.4500000000000001E-2,9.4499999999999993,0.20599999999999999,206,0.14299999999999999,290,{"$f":"VLOOKUP(U493,'Powder Core Toroid OD'!$A$2:$B$36,2,FALSE)","v":9.65}]
[58308,"C058308A2",310,160,"High Flux",115,"Toroid",5.67,56.7,0.52500000000000002,13.3,0.93,23.7,0.33,8.39,0.317,31.7,1.8,1800,1.39,310,{"$f":"VLOOKUP(U494,'Powder Core Toroid OD'!$A$2:$B$36,2,FALSE)","v":22.9}]
[58309,"C058309A2",310,147,"High Flux",106,"Toroid",5.67,56.7,0.52500000000000002,13.3,0.93,23.7,0.33,8.39,0.317,31.7,1.8,1800,1.39,310,{"$f":"VLOOKUP(U495,'Powder Core Toroid OD'!$A$2:$B$36,2,FALSE)","v":22.9}]
[58310,"C058310A2",310,125,"High Flux",90,"Toroid",5.67,56.7,0.52500000000000002,13.3,0.93,23.7,0.33,8.39,0.317,31.7,1.8,1800,1.39,310,{"$f":"VLOOKUP(U496,'Powder Core Toroid OD'!$A$2:$B$36,2,FALSE)","v":22.9}]
[58312,"0058312A2",310,26,"High Flux",19,"Toroid",5.67,56.7,0.52500000000000002,13.3,0.93,23.7,0.33,8.39,0.317,31.7,1.8,1800,1.39,310,{"$f":"VLOOKUP(U497,'Powder Core Toroid OD'!$A$2:$B$36,2,FALSE)","v":22.9}]
[58313,"0058313A2",310,14,"High Flux",9.9,"Toroid",5.67,56.7,0.52500000000000002,13.3,0.93,23.7,0.33,8.39,0.317,31.7,1.8,1800,1.39,310,{"$f":"VLOOKUP(U498,'Powder Core Toroid OD'!$A$2:$B$36,2,FALSE)","v":22.9}]
[58322,"C058322A2",324,160,"High Flux",150,"Toroid",8.98,89.800000000000011,0.84799999999999998,21.5,1.4450000000000001,36.71,0.44700000000000001,11.4,0.67800000000000005,67.800000000000011,6.09,6090,3.64,324,{"$f":"VLOOKUP(U499,'Powder Core Toroid OD'!$A$2:$B$36,2,FALSE)","v":35.799999999999997}]
[58324,"C058324A2",324,125,"High Flux",117,"Toroid",8.98,89.800000000000011,0.84799999999999998,21.5,1.4450000000000001,36.71,0.44700000000000001,11.4,0.67800000000000005,67.800000000000011,6.09,6090,3.64,324,{"$f":"VLOOKUP(U500,'Powder Core Toroid OD'!$A$2:$B$36,2,FALSE)","v":35.799999999999997}]
[58326,"0058326A2",324,26,"High Flux",24,"Toroid",8.98,89.800000000000011,0.84799999999999998,21.5,1.4450000000000001,36.71,0.44700000000000001,11.4,0.67800000000000005,67.800000000000011,6.09,6090,3.64,324,{"$f":"VLOOKUP(U501,'Powder Core Toroid OD'!$A$2:$B$36,2,FALSE)","v":35.799999999999997}]
[58327,"0058327A2",324,14,"High Flux",13,"Toroid",8.98,89.800000000000011,0.84799999999999998,21.5,1.4450000000000001,36.71,0.44700000000000001,11.4,0.67800000000000005,67.800000000000011,6.09,6090,3.64,324,{"$f":"VLOOKUP(U502,'Powder Core Toroid OD'!$A$2:$B$36,2,FALSE)","v":35.799999999999997}]
[58348,"C058348A2",350,160,"High Flux",135,"Toroid",5.88,58.8,0.54200000000000004,13.7,0.95799999999999996,24.4,0.38,9.66,0.38800000000000001,38.800000000000004,2.2799999999999998,2280,1.49,350,{"$f":"VLOOKUP(U503,'Powder Core Toroid OD'!$A$2:$B$36,2,FALSE)","v":23.6}]
[58349,"C058349A2",350,147,"High Flux",124,"Toroid",5.88,58.8,0.54200000000000004,13.7,0.95799999999999996,24.4,0.38,9.66,0.38800000000000001,38.800000000000004,2.2799999999999998,2280,1.49,350,{"$f":"VLOOKUP(U504,'Powder Core Toroid OD'!$A$2:$B$36,2,FALSE)","v":23.6}]
[58350,"C058350A2",350,125,"High Flux",105,"Toroid",5.88,58.8,0.54200000000000004,13.7,0.95799999999999996,24.4,0.38,9.66,0.38800000000000001,38.800000000000004,2.2799999999999998,2280,1.49,350,{"$f":"VLOOKUP(U505,'Powder Core Toroid OD'!$A$2:$B$36,2,FALSE)","v":23.6}]
[58351,"C058351A2",350,60,"High Flux",51,"Toroid",5.88,58.8,0.54200000000000004,13.7,0.95799999999999996,24.4,0.38,9.66,0.38800000000000001,38.800000000000004,2.2799999999999998,2280,1.49,350,{"$f":"VLOOKUP(U506,'Powder Core Toroid OD'!$A$2:$B$36,2,FALSE)","v":23.6}]
[58352,"0058352A2",350,26,"High Flux",22,"Toroid",5.88,58.8,0.54200000000000004,13.7,0.95799999999999996,24.4,0.38,9.66,0.38800000000000001,38.800000000000004,2.2799999999999998,2280,1.49,{"$f":"C507*1","v":350},{"$f":"VLOOKUP(U507,'Powder Core Toroid OD'!$A$2:$B$36,2,FALSE)","v":23.6}]
[58353,"0058353A2",350,14,"High Flux",12,"Toroid",5.88,58.8,0.54200000000000004,13.7,0.95799999999999996,24.4,0.38,9.66,0.38800000000000001,38.800000000000004,2.2799999999999998,2280,1.49,350,{"$f":"VLOOKUP(U508,'Powder Core Toroid OD'!$A$2:$B$36,2,FALSE)","v":23.6}]
[58378,"C058378A2",380,160,"High Flux",114,"Toroid",4.1399999999999997,41.4,0.35499999999999998,9.01,0.71,18.100000000000001,0.28000000000000003,7.12,0.23200000000000001,23.200000000000003,0.96,960,0.63800000000000001,380,{"$f":"VLOOKUP(U509,'Powder Core Toroid OD'!$A$2:$B$36,2,FALSE)","v":17.3}]
[58379,"C058379A2",380,147,"High Flux",105,"Toroid",4.1399999999999997,41.4,0.35499999999999998,9.01,0.71,18.100000000000001,0.28000000000000003,7.12,0.23200000000000001,23.200000000000003,0.96,960,0.63800000000000001,380,{"$f":"VLOOKUP(U510,'Powder Core Toroid OD'!$A$2:$B$36,2,FALSE)","v":17.3}]
[58380,"C058380A2",380,125,"High Flux",89,"Toroid",4.1399999999999997,41.4,0.35499999999999998,9.01,0.71,18.100000000000001,0.28000000000000003,7.12,0.23200000000000001,23.200000000000003,0.96,960,0.63800000000000001,380,{"$f":"VLOOKUP(U511,'Powder Core Toroid OD'!$A$2:$B$36,2,FALSE)","v":17.3}]
[58381,"C058381A2",380,60,"High Flux",43,"Toroid",4.1399999999999997,41.4,0.35499999999999998,9.01,0.71,18.100000000000001,0.28000000000000003,7.12,0.23200000000000001,23.200000000000003,0.96,960,0.63800000000000001,380,{"$f":"VLOOKUP(U512,'Powder Core Toroid OD'!$A$2:$B$36,2,FALSE)","v":17.3}]
[58382,"0058382A2",380,26,"High Flux",19,"Toroid",4.1399999999999997,41.4,0.35499999999999998,9.01,0.71,18.100000000000001,0.28000000000000003,7.12,0.23200000000000001,23.200000000000003,0.96,960,0.63800000000000001,380,{"$f":"VLOOKUP(U513,'Powder Core Toroid OD'!$A$2:$B$36,2,FALSE)","v":17.3}]
[58383,"0058383A2",380,14,"High Flux",10,"Toroid",4.1399999999999997,41.4,0.35499999999999998,9.01,0.71,18.100000000000001,0.28000000000000003,7.12,0.23200000000000001,23.200000000000003,0.96,960,0.63800000000000001,380,{"$f":"VLOOKUP(U514,'Powder Core Toroid OD'!$A$2:$B$36,2,FALSE)","v":17.3}]
[58408,"C058408A2",410,160,"High Flux",89,"Toroid",1.65,16.5,0.13600000000000001,3.45,0.29499999999999998,7.5,0.22500000000000001,5.72,7.2499999999999995E-2,7.25,0.12,120,9.35E-2,410,{"$f":"VLOOKUP(U515,'Powder Core Toroid OD'!$A$2:$B$36,2,FALSE)","v":6.86}]
[58410,"C058410A2",410,125,"High Flux",70,"Toroid",1.65,16.5,0.13600000000000001,3.45,0.29499999999999998,7.5,0.22500000000000001,5.72,7.2499999999999995E-2,7.25,0.12,120,9.35E-2,410,{"$f":"VLOOKUP(U516,'Powder Core Toroid OD'!$A$2:$B$36,2,FALSE)","v":6.86}]
[58438,"C058438A2",438,125,"High Flux",281,"Toroid",10.7,107,0.91800000000000004,23.3,1.875,47.63,0.745,19,1.99,199,21.3,21300,4.2699999999999996,438,{"$f":"VLOOKUP(U517,'Powder Core Toroid OD'!$A$2:$B$36,2,FALSE)","v":46.7}]
[58439,"C058439A2",438,60,"High Flux",135,"Toroid",10.7,107,0.91800000000000004,23.3,1.875,47.63,0.745,19,1.99,199,21.3,21300,4.2699999999999996,438,{"$f":"VLOOKUP(U518,'Powder Core Toroid OD'!$A$2:$B$36,2,FALSE)","v":46.7}]
[58440,"0058440A2",438,26,"High Flux",59,"Toroid",10.7,107,0.91800000000000004,23.3,1.875,47.63,0.745,19,1.99,199,21.3,21300,4.2699999999999996,438,{"$f":"VLOOKUP(U519,'Powder Core Toroid OD'!$A$2:$B$36,2,FALSE)","v":46.7}]
[58441,"0058441A2",438,14,"High Flux",32,"Toroid",10.7,107,0.91800000000000004,23.3,1.875,47.63,0.745,19,1.99,199,21.3,21300,4.2699999999999996,438,{"$f":"VLOOKUP(U520,'Powder Core Toroid OD'!$A$2:$B$36,2,FALSE)","v":46.7}]
[58546,"C058546A2",548,160,"High Flux",163,"Toroid",8.14,81.400000000000006,0.76600000000000001,19.399999999999999,1.325,33.659999999999997,0.45,11.5,0.65600000000000003,65.600000000000009,5.34,5340,2.97,548,{"$f":"VLOOKUP(U521,'Powder Core Toroid OD'!$A$2:$B$36,2,FALSE)","v":32.799999999999997}]
[58547,"C058547A2",548,147,"High Flux",150,"Toroid",8.14,81.400000000000006,0.76600000000000001,19.399999999999999,1.325,33.659999999999997,0.45,11.5,0.65600000000000003,65.600000000000009,5.34,5340,2.97,548,{"$f":"VLOOKUP(U522,'Powder Core Toroid OD'!$A$2:$B$36,2,FALSE)","v":32.799999999999997}]
[58548,"C058548A2",548,125,"High Flux",127,"Toroid",8.14,81.400000000000006,0.76600000000000001,19.399999999999999,1.325,33.659999999999997,0.45,11.5,0.65600000000000003,65.600000000000009,5.34,5340,2.97,548,{"$f":"VLOOKUP(U523,'Powder Core Toroid OD'!$A$2:$B$36,2,FALSE)","v":32.799999999999997}]
[58550,"0058550A2",548,26,"High Flux",28,"Toroid",8.14,81.400000000000006,0.76600000000000001,19.399999999999999,1.325,33.659999999999997,0.45,11.5,0.65600000000000003,65.600000000000009,5.34,5340,2.97,548,{"$f":"VLOOKUP(U524,'Powder Core Toroid OD'!$A$2:$B$36,2,FALSE)","v":32.799999999999997}]
[58551,"0058551A2",548,14,"High Flux",14,"Toroid",8.14,81.400000000000006,0.76600000000000001,19.399999999999999,1.325,33.659999999999997,0.45,11.5,0.65600000000000003,65.600000000000009,5.34,5340,2.97,548,{"$f":"VLOOKUP(U525,'Powder Core Toroid OD'!$A$2:$B$36,2,FALSE)","v":32.799999999999997}]
[58583,"C058583A2",585,160,"High Flux",101,"Toroid",8.9499999999999993,89.5,0.88800000000000001,22.5,1.385,35.18,0.38500000000000001,9.7799999999999994,0.46400000000000002,46.4,4.1500000000000004,4150,3.99,585,{"$f":"VLOOKUP(U526,'Powder Core Toroid OD'!$A$2:$B$36,2,FALSE)","v":34.299999999999997}]
[58585,"C058585A2",585,125,"High Flux",79,"Toroid",8.9499999999999993,89.5,0.88800000000000001,22.5,1.385,35.18,0.38500000000000001,9.7799999999999994,0.46400000000000002,46.4,4.1500000000000004,4150,3.99,585,{"$f":"VLOOKUP(U527,'Powder Core Toroid OD'!$A$2:$B$36,2,FALSE)","v":34.299999999999997}]
[58586,"C058586A2",585,60,"High Flux",38,"Toroid",8.9499999999999993,89.5,0.88800000000000001,22.5,1.385,35.18,0.38500000000000001,9.7799999999999994,0.46400000000000002,46.4,4.1500000000000004,4150,3.99,585,{"$f":"VLOOKUP(U528,'Powder Core Toroid OD'!$A$2:$B$36,2,FALSE)","v":34.299999999999997}]
[58714,"C058714A2",715,147,"High Flux",179,"Toroid",12.7,127,1.218,30.93,2.0350000000000001,51.69,0.56500000000000006,14.4,1.25,125,15.9,15900,7.51,715,{"$f":"VLOOKUP(U529,'Powder Core Toroid OD'!$A$2:$B$36,2,FALSE)","v":50.8}]
[58715,"C058715A2",715,125,"High Flux",152,"Toroid",12.7,127,1.218,30.93,2.0350000000000001,51.69,0.56500000000000006,14.4,1.25,125,15.9,15900,7.51,715,{"$f":"VLOOKUP(U530,'Powder Core Toroid OD'!$A$2:$B$36,2,FALSE)","v":50.8}]
[58716,"C058716A2",715,60,"High Flux",73,"Toroid",12.7,127,1.218,30.93,2.0350000000000001,51.69,0.56500000000000006,14.4,1.25,125,15.9,15900,7.51,715,{"$f":"VLOOKUP(U531,'Powder Core Toroid OD'!$A$2:$B$36,2,FALSE)","v":50.8}]
[58717,"0058717A2",715,26,"High Flux",32,"Toroid",12.7,127,1.218,30.93,2.0350000000000001,51.69,0.56500000000000006,14.4,1.25,125,15.9,15900,7.51,715,{"$f":"VLOOKUP(U532,'Powder Core Toroid OD'!$A$2:$B$36,2,FALSE)","v":50.8}]
[58718,"0058718A2",715,14,"High Flux",17,"Toroid",12.7,127,1.218,30.93,2.0350000000000001,51.69,0.56500000000000006,14.4,1.25,125,15.9,15900,7.51,715,{"$f":"VLOOKUP(U533,'Powder Core Toroid OD'!$A$2:$B$36,2,FALSE)","v":50.8}]
[58848,"C058848A2",206,60,"High Flux",32,"Toroid",5.09,50.9,0.47500000000000003,12,0.83,21.1,0.28000000000000003,7.12,0.221,22.1,1.1200000000000001,1120,1.1399999999999999,206,{"$f":"VLOOKUP(U534,'Powder Core Toroid OD'!$A$2:$B$36,2,FALSE)","v":20.3}]
[58866,"C058866A2",866,125,"High Flux",142,"Toroid",19.600000000000001,196,1.8979999999999999,48.2,3.1080000000000001,78.95,0.54500000000000004,13.9,1.76,176,34.5,34500,18.2,866,{"$f":"VLOOKUP(U535,'Powder Core Toroid OD'!$A$2:$B$36,2,FALSE)","v":77.8}]
[58867,"C058867A2",866,60,"High Flux",68,"Toroid",19.600000000000001,196,1.8979999999999999,48.2,3.1080000000000001,78.95,0.54500000000000004,13.9,1.76,176,34.5,34500,18.2,866,{"$f":"VLOOKUP(U536,'Powder Core Toroid OD'!$A$2:$B$36,2,FALSE)","v":77.8}]
[58868,"0058868A2",866,26,"High Flux",30,"Toroid",19.600000000000001,196,1.8979999999999999,48.2,3.1080000000000001,78.95,0.54500000000000004,13.9,1.76,176,34.5,34500,18.2,866,{"$f":"VLOOKUP(U537,'Powder Core Toroid OD'!$A$2:$B$36,2,FALSE)","v":77.8}]
[58869,"0058869A2",866,14,"High Flux",16,"Toroid",19.600000000000001,196,1.8979999999999999,48.2,3.1080000000000001,78.95,0.54500000000000004,13.9,1.76,176,34.5,34500,18.2,866,{"$f":"VLOOKUP(U538,'Powder Core Toroid OD'!$A$2:$B$36,2,FALSE)","v":77.8}]
[58894,"C058894A2",930,60,"High Flux",75,"Toroid",6.35,63.5,0.55500000000000005,14.1,1.0900000000000001,27.69,0.47,12,0.65400000000000003,65.400000000000006,4.1500000000000004,4150,1.56,930,{"$f":"VLOOKUP(U539,'Powder Core Toroid OD'!$A$2:$B$36,2,FALSE)","v":26.9}]
[58906,"C058906A2",906,125,"High Flux",178,"Toroid",19.600000000000001,196,1.8979999999999999,48.2,3.1080000000000001,78.95,0.67,17.100000000000001,2.21,221,43.4,43400,18.2,906,{"$f":"VLOOKUP(U540,'Powder Core Toroid OD'!$A$2:$B$36,2,FALSE)","v":77.8}]
[58907,"C058907A2",906,60,"High Flux",85,"Toroid",19.600000000000001,196,1.8979999999999999,48.2,3.1080000000000001,78.95,0.67,17.100000000000001,2.21,221,43.4,43400,18.2,906,{"$f":"VLOOKUP(U541,'Powder Core Toroid OD'!$A$2:$B$36,2,FALSE)","v":77.8}]
[58908,"0058908A2",906,26,"High Flux",37,"Toroid",19.600000000000001,196,1.8979999999999999,48.2,3.1080000000000001,78.95,0.67,17.100000000000001,2.21,221,43.4,43400,18.2,906,{"$f":"VLOOKUP(U542,'Powder Core Toroid OD'!$A$2:$B$36,2,FALSE)","v":77.8}]
[58909,"0058909A2",906,14,"High Flux",20,"Toroid",19.600000000000001,196,1.8979999999999999,48.2,3.1080000000000001,78.95,0.67,17.100000000000001,2.21,221,43.4,43400,18.2,906,{"$f":"VLOOKUP(U543,'Powder Core Toroid OD'!$A$2:$B$36,2,FALSE)","v":77.8}]
[58928,"C058928A2",930,160,"High Flux",201,"Toroid",6.35,63.5,0.55500000000000005,14.1,1.0900000000000001,27.69,0.47,12,0.65400000000000003,65.400000000000006,4.1500000000000004,4150,1.56,930,{"$f":"VLOOKUP(U544,'Powder Core Toroid OD'!$A$2:$B$36,2,FALSE)","v":26.9}]
[58929,"C058929A2",930,147,"High Flux",185,"Toroid",6.35,63.5,0.55500000000000005,14.1,1.0900000000000001,27.69,0.47,12,0.65400000000000003,65.400000000000006,4.1500000000000004,4150,1.56,930,{"$f":"VLOOKUP(U545,'Powder Core Toroid OD'!$A$2:$B$36,2,FALSE)","v":26.9}]
[58930,"C058930A2",930,125,"High Flux",157,"Toroid",6.35,63.5,0.55500000000000005,14.1,1.0900000000000001,27.69,0.47,12,0.65400000000000003,65.400000000000006,4.1500000000000004,4150,1.56,930,{"$f":"VLOOKUP(U546,'Powder Core Toroid OD'!$A$2:$B$36,2,FALSE)","v":26.9}]
[58932,"0058932A2",930,26,"High Flux",32,"Toroid",6.35,63.5,0.55500000000000005,14.1,1.0900000000000001,27.69,0.47,12,0.65400000000000003,65.400000000000006,4.1500000000000004,4150,1.56,930,{"$f":"VLOOKUP(U547,'Powder Core Toroid OD'!$A$2:$B$36,2,FALSE)","v":26.9}]
[58933,"0058933A2",930,14,"High Flux",18,"Toroid",6.35,63.5,0.55500000000000005,14.1,1.0900000000000001,27.69,0.47,12,0.65400000000000003,65.400000000000006,4.1500000000000004,4150,1.56,930,{"$f":"VLOOKUP(U548,'Powder Core Toroid OD'!$A$2:$B$36,2,FALSE)","v":26.9}]
[6527,"00K6527E026","6527",26,"Kool Mu",162,"E Core",14.7,147,1.2949999999999999,32.89,2.6150000000000002,66.42,1.079,27.41,5.4,540,79.400000000000006,79400]
[6527,"00K6527E040","6527",40,"Kool Mu",230,"E Core",14.7,147,1.2949999999999999,32.89,2.6150000000000002,66.42,1.079,27.41,5.4,540,79.400000000000006,79400]
[6527,"00K6527E060","6527",60,"Kool Mu",300,"E Core",14.7,147,1.2949999999999999,32.89,2.6150000000000002,66.42,1.079,27.41,5.4,540,79.400000000000006,79400]
[6527,"00K6527U026","6527",26,"Kool Mu",89,"U Core",21.9,219,1.292,32.82,2.6179999999999999,66.5,1.079,27.41,2.7,270,59.1,59100]
[6527,"00K6527U060","6527",60,"Kool Mu",165,"U Core",21.9,219,1.292,32.82,2.6179999999999999,66.5,1.079,27.41,2.7,270,59.1,59100]
[6533,"00K6533U026","6533",26,"Kool Mu",82,"U Core",19.899999999999999,199,1.292,32.82,2.6179999999999999,66.5,0.80400000000000005,20.420000000000002,2.5,250,49.8,49800]
[7228,"00K7228E026","7228",26,"Kool Mu",130,"E Core",13.7,137,1.1200000000000001,28.45,2.8929999999999998,73.48,0.76500000000000001,19.5,3.68,368,50.4,50400]
[7228,"00K7228E040","7228",40,"Kool Mu",173,"E Core",13.7,137,1.1200000000000001,28.45,2.8929999999999998,73.48,0.76500000000000001,19.5,3.68,368,50.4,50400]
[7228,"00K7228E060","7228",60,"Kool Mu",236,"E Core",13.7,137,1.1200000000000001,28.45,2.8929999999999998,73.48,0.76500000000000001,19.5,3.68,368,50.4,50400]
[7236,"00K7236U026","7236",26,"Kool Mu",87,"U Core",21.9,219,1.425,36.200000000000003,2.8849999999999998,73.28,0.83599999999999997,21.3,2.9,290,63.5,63500]
[77020,"0077020A7","020",125,"Kool Mu",50,"Toroid",1.36,13.6,0.09,2.2799999999999998,0.27500000000000002,6.99,0.13500000000000001,3.43,4.7E-2,4.7,6.4000000000000001E-2,64,4.0800000000000003E-2,{"$f":"C559*1","v":20},{"$f":"VLOOKUP(U559,'Powder Core Toroid OD'!$A$2:$B$36,2,FALSE)","v":6.35}]
[77021,"0077021A7","020",60,"Kool Mu",24,"Toroid",1.36,13.6,0.09,2.2799999999999998,0.27500000000000002,6.99,0.13500000000000001,3.43,4.7E-2,4.7,6.4000000000000001E-2,64,4.0800000000000003E-2,20,{"$f":"VLOOKUP(U560,'Powder Core Toroid OD'!$A$2:$B$36,2,FALSE)","v":6.35}]
[77030,"0077030A7","030",125,"Kool Mu",52,"Toroid",1.79,17.899999999999999,0.13600000000000001,3.45,0.33500000000000002,8.51,0.15,3.8099999999999996,5.9900000000000002E-2,5.99,0.107,107,9.35E-2,30,{"$f":"VLOOKUP(U561,'Powder Core Toroid OD'!$A$2:$B$36,2,FALSE)","v":7.87}]
[77031,"0077031A7","030",60,"Kool Mu",25,"Toroid",1.79,17.899999999999999,0.13600000000000001,3.45,0.33500000000000002,8.51,0.15,3.8099999999999996,5.9900000000000002E-2,5.99,0.107,107,9.35E-2,30,{"$f":"VLOOKUP(U562,'Powder Core Toroid OD'!$A$2:$B$36,2,FALSE)","v":7.87}]
[77040,"0077040A7","040",125,"Kool Mu",66,"Toroid",2.2999999999999998,23,0.18,4.57,0.42499999999999999,10.8,0.18099999999999999,4.5999999999999996,9.5699999999999993E-2,9.5699999999999985,0.22,220,0.16400000000000001,40,{"$f":"VLOOKUP(U563,'Powder Core Toroid OD'!$A$2:$B$36,2,FALSE)","v":10.199999999999999}]
[77041,"0077041A7","040",60,"Kool Mu",32,"Toroid",2.2999999999999998,23,0.18,4.57,0.42499999999999999,10.8,0.18099999999999999,4.5999999999999996,9.5699999999999993E-2,9.5699999999999985,0.22,220,0.16400000000000001,40,{"$f":"VLOOKUP(U564,'Powder Core Toroid OD'!$A$2:$B$36,2,FALSE)","v":10.199999999999999}]
[77050,"0077050A7","050",125,"Kool Mu",56,"Toroid",3.12,31.200000000000003,0.27500000000000002,6.98,0.53,13.5,0.217,5.52,0.109,10.9,0.34,340,0.38300000000000001,50,{"$f":"VLOOKUP(U565,'Powder Core Toroid OD'!$A$2:$B$36,2,FALSE)","v":12.7}]
[77051,"0077051A7","050",60,"Kool Mu",27,"Toroid",3.12,31.200000000000003,0.27500000000000002,6.98,0.53,13.5,0.217,5.52,0.109,10.9,0.34,340,0.38300000000000001,50,{"$f":"VLOOKUP(U566,'Powder Core Toroid OD'!$A$2:$B$36,2,FALSE)","v":12.7}]
[77052,"0077052A7","050",26,"Kool Mu",12,"Toroid",3.12,31.2,0.27500000000000002,6.98,0.53,13.5,0.217,5.52,0.109,10.9,0.34,340,0.38300000000000001,50,{"$f":"VLOOKUP(U567,'Powder Core Toroid OD'!$A$2:$B$36,2,FALSE)","v":12.7}]
[77054,"0077054A7","050",90,"Kool Mu",40,"Toroid",3.12,31.200000000000003,0.27500000000000002,6.98,0.53,13.5,0.217,5.52,0.109,10.9,0.34,340,0.38300000000000001,50,{"$f":"VLOOKUP(U568,'Powder Core Toroid OD'!$A$2:$B$36,2,FALSE)","v":12.7}]
[77055,"0077055A7","050",75,"Kool Mu",34,"Toroid",3.12,31.200000000000003,0.27500000000000002,6.98,0.53,13.5,0.217,5.52,0.109,10.9,0.34,340,0.38300000000000001,50,{"$f":"VLOOKUP(U569,'Powder Core Toroid OD'!$A$2:$B$36,2,FALSE)","v":12.7}]
[77059,"0077059A7",310,60,"Kool Mu",43,"Toroid",5.67,56.7,0.52500000000000002,13.3,0.93,23.7,0.33,8.39,0.317,31.7,1.8,1800,1.39,310,{"$f":"VLOOKUP(U570,'Powder Core Toroid OD'!$A$2:$B$36,2,FALSE)","v":22.9}]
[77071,"0077071A7",548,60,"Kool Mu",61,"Toroid",8.14,81.400000000000006,0.76600000000000001,19.399999999999999,1.325,33.659999999999997,0.45,11.5,0.65600000000000003,65.599999999999994,5.34,5340,2.97,548,{"$f":"VLOOKUP(U571,'Powder Core Toroid OD'!$A$2:$B$36,2,FALSE)","v":32.799999999999997}]
[77076,"0077076A7",324,60,"Kool Mu",56,"Toroid",8.98,89.800000000000011,0.84799999999999998,21.5,1.4450000000000001,36.71,0.44700000000000001,11.4,0.67800000000000005,67.800000000000011,6.09,6090,3.64,324,{"$f":"VLOOKUP(U572,'Powder Core Toroid OD'!$A$2:$B$36,2,FALSE)","v":35.799999999999997}]
[77083,"0077083A7",254,60,"Kool Mu",81,"Toroid",9.84,98.4,0.91800000000000004,23.3,1.605,40.770000000000003,0.60499999999999998,15.4,1.07,107,10.6,10600,4.2699999999999996,254,{"$f":"VLOOKUP(U573,'Powder Core Toroid OD'!$A$2:$B$36,2,FALSE)","v":39.9}]
[77089,"0077089A7","089",125,"Kool Mu",178,"Toroid",11.6,116,1.0980000000000001,27.88,1.875,47.63,0.63500000000000001,16.100000000000001,1.34,134,15.6,15600,6.1,89,{"$f":"VLOOKUP(U574,'Powder Core Toroid OD'!$A$2:$B$36,2,FALSE)","v":46.7}]
[77090,"0077090A7","089",60,"Kool Mu",86,"Toroid",11.6,116,1.0980000000000001,27.88,1.875,47.63,0.63500000000000001,16.100000000000001,1.34,134,15.6,15600,6.1,89,{"$f":"VLOOKUP(U575,'Powder Core Toroid OD'!$A$2:$B$36,2,FALSE)","v":46.7}]
[77091,"0077091A7","089",26,"Kool Mu",37,"Toroid",11.6,116,1.0980000000000001,27.88,1.875,47.63,0.63500000000000001,16.100000000000001,1.34,134,15.6,15600,6.1,89,{"$f":"VLOOKUP(U576,'Powder Core Toroid OD'!$A$2:$B$36,2,FALSE)","v":46.7}]
[77093,"0077093A7","089",90,"Kool Mu",128,"Toroid",11.6,116,1.0980000000000001,27.88,1.875,47.63,0.63500000000000001,16.100000000000001,1.34,134,15.6,15600,6.1,89,{"$f":"VLOOKUP(U577,'Powder Core Toroid OD'!$A$2:$B$36,2,FALSE)","v":46.7}]
[77094,"0077094A7","089",75,"Kool Mu",107,"Toroid",11.6,116,1.0980000000000001,27.88,1.875,47.63,0.63500000000000001,16.100000000000001,1.34,134,15.6,15600,6.1,89,{"$f":"VLOOKUP(U578,'Powder Core Toroid OD'!$A$2:$B$36,2,FALSE)","v":46.7}]
[77095,"0077095A7","089",40,"Kool Mu",57,"Toroid",11.6,116,1.0980000000000001,27.88,1.875,47.63,0.63500000000000001,16.100000000000001,1.34,134,15.6,15600,6.1,89,{"$f":"VLOOKUP(U579,'Powder Core Toroid OD'!$A$2:$B$36,2,FALSE)","v":46.7}]
[77109,"0077109A7",109,125,"Kool Mu",156,"Toroid",14.3,143,1.3680000000000001,34.74,2.2850000000000001,58.04,0.58499999999999996,14.9,1.44,144,20.7,20700,9.48,109,{"$f":"VLOOKUP(U580,'Powder Core Toroid OD'!$A$2:$B$36,2,FALSE)","v":57.2}]
[77110,"0077110A7",109,60,"Kool Mu",75,"Toroid",14.3,143,1.3680000000000001,34.74,2.2850000000000001,58.04,0.58499999999999996,14.9,1.44,144,20.7,20700,9.48,109,{"$f":"VLOOKUP(U581,'Powder Core Toroid OD'!$A$2:$B$36,2,FALSE)","v":57.2}]
[77111,"0077111A7",109,26,"Kool Mu",33,"Toroid",14.3,143,1.3680000000000001,34.74,2.2850000000000001,58.04,0.58499999999999996,14.9,1.44,144,20.7,20700,9.48,109,{"$f":"VLOOKUP(U582,'Powder Core Toroid OD'!$A$2:$B$36,2,FALSE)","v":57.2}]
[77120,"0077120A7",120,125,"Kool Mu",72,"Toroid",4.12,41.2,0.375,9.52,0.68,17.3,0.28000000000000003,7.12,0.192,19.2,0.79100000000000004,791,0.71199999999999997,120,{"$f":"VLOOKUP(U583,'Powder Core Toroid OD'!$A$2:$B$36,2,FALSE)","v":16.600000000000001}]
[77121,"0077121A7",120,60,"Kool Mu",35,"Toroid",4.12,41.2,0.375,9.52,0.68,17.3,0.28000000000000003,7.12,0.192,19.2,0.79100000000000004,791,0.71199999999999997,120,{"$f":"VLOOKUP(U584,'Powder Core Toroid OD'!$A$2:$B$36,2,FALSE)","v":16.600000000000001}]
[77130,"0077130A7",130,125,"Kool Mu",53,"Toroid",2.69,26.9,0.23,5.84,0.46500000000000002,11.9,0.18099999999999999,4.5999999999999996,9.06E-2,9.06,0.24399999999999999,244,0.26800000000000002,130,{"$f":"VLOOKUP(U585,'Powder Core Toroid OD'!$A$2:$B$36,2,FALSE)","v":11.2}]
[77131,"0077131A7",130,60,"Kool Mu",26,"Toroid",2.69,26.9,0.23,5.84,0.46500000000000002,11.9,0.18099999999999999,4.5999999999999996,9.06E-2,9.06,0.24399999999999999,244,0.26800000000000002,130,{"$f":"VLOOKUP(U586,'Powder Core Toroid OD'!$A$2:$B$36,2,FALSE)","v":11.2}]
[77140,"0077140A7",140,125,"Kool Mu",26,"Toroid",0.80600000000000005,8.06,0.05,1.27,0.16500000000000001,4.2,8.5000000000000006E-2,2.16,1.2999999999999999E-2,1.3,1.0500000000000001E-2,10.5,1.2699999999999999E-2,140,{"$f":"VLOOKUP(U587,'Powder Core Toroid OD'!$A$2:$B$36,2,FALSE)","v":3.56}]
[77141,"0077141A7",140,60,"Kool Mu",13,"Toroid",0.80600000000000005,8.06,0.05,1.27,0.16500000000000001,4.2,8.5000000000000006E-2,2.16,1.2999999999999999E-2,1.3,1.0500000000000001E-2,10.5,1.2699999999999999E-2,140,{"$f":"VLOOKUP(U588,'Powder Core Toroid OD'!$A$2:$B$36,2,FALSE)","v":3.56}]
[77150,"0077150A7",150,125,"Kool Mu",35,"Toroid",0.94199999999999995,9.42,6.8000000000000005E-2,1.72,0.18,4.58,0.125,3.18,2.1100000000000001E-2,2.11,1.9900000000000001E-2,19.899999999999999,2.3199999999999998E-2,150,{"$f":"VLOOKUP(U589,'Powder Core Toroid OD'!$A$2:$B$36,2,FALSE)","v":3.94}]
[77151,"0077151A7",150,60,"Kool Mu",17,"Toroid",0.94199999999999995,9.42,6.8000000000000005E-2,1.72,0.18,4.58,0.125,3.18,2.1100000000000001E-2,2.11,1.9900000000000001E-2,19.899999999999999,2.3199999999999998E-2,150,{"$f":"VLOOKUP(U590,'Powder Core Toroid OD'!$A$2:$B$36,2,FALSE)","v":3.94}]
[77154,"0077154A7",150,90,"Kool Mu",25,"Toroid",0.94199999999999995,9.42,6.8000000000000005E-2,1.72,0.18,4.58,0.125,3.18,2.1100000000000001E-2,2.11,1.9900000000000001E-2,19.899999999999999,2.3199999999999998E-2,150,{"$f":"VLOOKUP(U591,'Powder Core Toroid OD'!$A$2:$B$36,2,FALSE)","v":3.94}]
[77180,"0077180A7",180,125,"Kool Mu",42,"Toroid",1.06,10.6,7.2999999999999995E-2,1.85,0.20799999999999999,5.29,0.125,3.18,2.8500000000000001E-2,2.85,3.0300000000000001E-2,30.3,2.69E-2,180,{"$f":"VLOOKUP(U592,'Powder Core Toroid OD'!$A$2:$B$36,2,FALSE)","v":4.6500000000000004}]
[77181,"0077181A7",180,60,"Kool Mu",20,"Toroid",1.06,10.6,7.2999999999999995E-2,1.85,0.20799999999999999,5.29,0.125,3.18,2.8500000000000001E-2,2.85,3.0300000000000001E-2,30.3,2.69E-2,180,{"$f":"VLOOKUP(U593,'Powder Core Toroid OD'!$A$2:$B$36,2,FALSE)","v":4.6500000000000004}]
[77184,"0077184A7",180,90,"Kool Mu",30,"Toroid",1.06,10.6,7.2999999999999995E-2,1.85,0.20799999999999999,5.29,0.125,3.18,2.8500000000000001E-2,2.85,3.0300000000000001E-2,30.3,2.69E-2,180,{"$f":"VLOOKUP(U594,'Powder Core Toroid OD'!$A$2:$B$36,2,FALSE)","v":4.6500000000000004}]
[77189,"0077189A7",195,40,"Kool Mu",92,"Toroid",12.5,125,1.0069999999999999,25.57,2.2850000000000001,58.04,0.63500000000000001,16.2,2.29,229,28.6,28600,5.14,195,{"$f":"VLOOKUP(U595,'Powder Core Toroid OD'!$A$2:$B$36,2,FALSE)","v":57.2}]
[77191,"0077191A7",195,26,"Kool Mu",60,"Toroid",12.5,125,1.0069999999999999,25.57,2.2850000000000001,58.04,0.63500000000000001,16.2,2.29,229,28.6,28600,5.14,195,{"$f":"VLOOKUP(U596,'Powder Core Toroid OD'!$A$2:$B$36,2,FALSE)","v":57.2}]
[77192,"0077192A7",195,60,"Kool Mu",138,"Toroid",12.5,125,1.0069999999999999,25.57,2.2850000000000001,58.04,0.63500000000000001,16.2,2.29,229,28.6,28600,5.14,195,{"$f":"VLOOKUP(U597,'Powder Core Toroid OD'!$A$2:$B$36,2,FALSE)","v":57.2}]
[77193,"0077193A7",195,75,"Kool Mu",172,"Toroid",12.5,125,1.0069999999999999,25.57,2.2850000000000001,58.04,0.63500000000000001,16.2,2.29,229,28.6,28600,5.14,195,{"$f":"VLOOKUP(U598,'Powder Core Toroid OD'!$A$2:$B$36,2,FALSE)","v":57.2}]
[77194,"0077194A7",195,90,"Kool Mu",207,"Toroid",12.5,125,1.0069999999999999,25.57,2.2850000000000001,58.04,0.63500000000000001,16.2,2.29,229,28.6,28600,5.14,195,{"$f":"VLOOKUP(U599,'Powder Core Toroid OD'!$A$2:$B$36,2,FALSE)","v":57.2}]
[77195,"0077195A7",195,125,"Kool Mu",287,"Toroid",12.5,125,1.0069999999999999,25.57,2.2850000000000001,58.04,0.63500000000000001,16.2,2.29,229,28.6,28600,5.14,195,{"$f":"VLOOKUP(U600,'Powder Core Toroid OD'!$A$2:$B$36,2,FALSE)","v":57.2}]
[77206,"0077206A7",206,125,"Kool Mu",68,"Toroid",5.09,50.9,0.47500000000000003,12,0.83,21.1,0.28000000000000003,7.12,0.221,22.1,1.1200000000000001,1120,1.1399999999999999,206,{"$f":"VLOOKUP(U601,'Powder Core Toroid OD'!$A$2:$B$36,2,FALSE)","v":20.3}]
[77210,"0077210A7",206,90,"Kool Mu",49,"Toroid",5.09,50.9,0.47500000000000003,12,0.83,21.1,0.28000000000000003,7.12,0.221,22.1,1.1200000000000001,1120,1.1399999999999999,206,{"$f":"VLOOKUP(U602,'Powder Core Toroid OD'!$A$2:$B$36,2,FALSE)","v":20.3}]
[77211,"0077211A7",206,75,"Kool Mu",41,"Toroid",5.09,50.9,0.47500000000000003,12,0.83,21.1,0.28000000000000003,7.12,0.221,22.1,1.1200000000000001,1120,1.1399999999999999,206,{"$f":"VLOOKUP(U603,'Powder Core Toroid OD'!$A$2:$B$36,2,FALSE)","v":20.3}]
[77212,"0077212A7",109,40,"Kool Mu",50,"Toroid",14.3,143,1.3680000000000001,34.74,2.2850000000000001,58.04,0.58499999999999996,14.9,1.44,144,20.7,20700,9.48,109,{"$f":"VLOOKUP(U604,'Powder Core Toroid OD'!$A$2:$B$36,2,FALSE)","v":57.2}]
[77213,"0077213A7",109,90,"Kool Mu",112,"Toroid",14.3,143,1.3680000000000001,34.74,2.2850000000000001,58.04,0.58499999999999996,14.9,1.44,144,20.7,20700,9.48,109,{"$f":"VLOOKUP(U605,'Powder Core Toroid OD'!$A$2:$B$36,2,FALSE)","v":57.2}]
[77214,"0077214A7",109,75,"Kool Mu",94,"Toroid",14.3,143,1.3680000000000001,34.74,2.2850000000000001,58.04,0.58499999999999996,14.9,1.44,144,20.7,20700,9.48,109,{"$f":"VLOOKUP(U606,'Powder Core Toroid OD'!$A$2:$B$36,2,FALSE)","v":57.2}]
[77224,"0077224A7",120,90,"Kool Mu",52,"Toroid",4.12,41.2,0.375,9.52,0.68,17.3,0.28000000000000003,7.12,0.192,19.2,0.79100000000000004,791,0.71199999999999997,120,{"$f":"VLOOKUP(U607,'Powder Core Toroid OD'!$A$2:$B$36,2,FALSE)","v":16.600000000000001}]
[77225,"0077225A7",120,75,"Kool Mu",43,"Toroid",4.12,41.2,0.375,9.52,0.68,17.3,0.28000000000000003,7.12,0.192,19.2,0.79100000000000004,791,0.71199999999999997,120,{"$f":"VLOOKUP(U608,'Powder Core Toroid OD'!$A$2:$B$36,2,FALSE)","v":16.600000000000001}]
[77240,"0077240A7",240,125,"Kool Mu",54,"Toroid",1.36,13.6,8.5000000000000006E-2,2.15,0.28499999999999998,7.24,0.125,3.18,4.7600000000000003E-2,4.7600000000000007,6.4899999999999999E-2,64.900000000000006,3.6299999999999999E-2,240,{"$f":"VLOOKUP(U609,'Powder Core Toroid OD'!$A$2:$B$36,2,FALSE)","v":6.6}]
[77244,"0077244A7",240,90,"Kool Mu",39,"Toroid",1.36,13.6,8.5000000000000006E-2,2.15,0.28499999999999998,7.24,0.125,3.18,4.7600000000000003E-2,4.7600000000000007,6.4899999999999999E-2,64.900000000000006,3.6299999999999999E-2,240,{"$f":"VLOOKUP(U610,'Powder Core Toroid OD'!$A$2:$B$36,2,FALSE)","v":6.6}]
[77254,"0077254A7",254,125,"Kool Mu",168,"Toroid",9.84,98.4,0.91800000000000004,23.3,1.605,40.770000000000003,0.60499999999999998,15.4,1.07,107,10.6,10600,4.2699999999999996,254,{"$f":"VLOOKUP(U611,'Powder Core Toroid OD'!$A$2:$B$36,2,FALSE)","v":39.9}]
[77256,"0077256A7",254,26,"Kool Mu",35,"Toroid",9.84,98.4,0.91800000000000004,23.3,1.605,40.770000000000003,0.60499999999999998,15.4,1.07,107,10.6,10600,4.2699999999999996,254,{"$f":"VLOOKUP(U612,'Powder Core Toroid OD'!$A$2:$B$36,2,FALSE)","v":39.9}]
[77258,"0077258A7",254,90,"Kool Mu",121,"Toroid",9.84,98.4,0.91800000000000004,23.3,1.605,40.770000000000003,0.60499999999999998,15.4,1.07,107,10.6,10600,4.2699999999999996,254,{"$f":"VLOOKUP(U613,'Powder Core Toroid OD'!$A$2:$B$36,2,FALSE)","v":39.9}]
[77259,"0077259A7",254,75,"Kool Mu",101,"Toroid",9.84,98.4,0.91800000000000004,23.3,1.605,40.770000000000003,0.60499999999999998,15.4,1.07,107,10.6,10600,4.2699999999999996,254,{"$f":"VLOOKUP(U614,'Powder Core Toroid OD'!$A$2:$B$36,2,FALSE)","v":39.9}]
[77260,"0077260A7",254,40,"Kool Mu",54,"Toroid",9.84,98.4,0.91800000000000004,23.3,1.605,40.770000000000003,0.60499999999999998,15.4,1.07,107,10.6,10600,4.2699999999999996,254,{"$f":"VLOOKUP(U615,'Powder Core Toroid OD'!$A$2:$B$36,2,FALSE)","v":39.9}]
[77270,"0077270A7",270,125,"Kool Mu",103,"Toroid",1.36,13.6,8.5000000000000006E-2,2.15,0.28500000000000003,7.24,0.21299999999999999,5.42,9.1999999999999998E-2,9.1999999999999993,0.125,125,3.6299999999999999E-2,270,{"$f":"VLOOKUP(U616,'Powder Core Toroid OD'!$A$2:$B$36,2,FALSE)","v":6.6}]
[77271,"0077271A7",270,60,"Kool Mu",50,"Toroid",1.36,13.6,8.5000000000000006E-2,2.15,0.28500000000000003,7.24,0.21299999999999999,5.42,9.1999999999999998E-2,9.1999999999999993,0.125,125,3.6299999999999999E-2,270,{"$f":"VLOOKUP(U617,'Powder Core Toroid OD'!$A$2:$B$36,2,FALSE)","v":6.6}]
[77280,"0077280A7",280,125,"Kool Mu",53,"Toroid",2.1800000000000002,21.8,0.16800000000000001,4.26,0.40500000000000003,10.3,0.15,3.8099999999999996,7.5200000000000003E-2,7.52,0.16400000000000001,164,0.14299999999999999,280,{"$f":"VLOOKUP(U618,'Powder Core Toroid OD'!$A$2:$B$36,2,FALSE)","v":9.65}]
[77281,"0077281A7",280,60,"Kool Mu",25,"Toroid",2.1800000000000002,21.8,0.16800000000000001,4.26,0.40500000000000003,10.3,0.15,3.8099999999999996,7.5200000000000003E-2,7.52,0.16400000000000001,164,0.14299999999999999,280,{"$f":"VLOOKUP(U619,'Powder Core Toroid OD'!$A$2:$B$36,2,FALSE)","v":9.65}]
[77290,"0077290A7",290,125,"Kool Mu",66,"Toroid",2.1800000000000002,21.8,0.16800000000000001,4.26,0.40500000000000003,10.3,0.18099999999999999,4.5999999999999996,9.4500000000000001E-2,9.4499999999999993,0.20599999999999999,206,0.14299999999999999,290,{"$f":"VLOOKUP(U620,'Powder Core Toroid OD'!$A$2:$B$36,2,FALSE)","v":9.65}]
[77291,"0077291A7",290,60,"Kool Mu",32,"Toroid",2.1800000000000002,21.8,0.16800000000000001,4.26,0.40500000000000003,10.3,0.18099999999999999,4.5999999999999996,9.4500000000000001E-2,9.4499999999999993,0.20599999999999999,206,0.14299999999999999,290,{"$f":"VLOOKUP(U621,'Powder Core Toroid OD'!$A$2:$B$36,2,FALSE)","v":9.65}]
[77294,"0077294A7",290,90,"Kool Mu",48,"Toroid",2.1800000000000002,21.8,0.16800000000000001,4.26,0.40500000000000003,10.3,0.18099999999999999,4.5999999999999996,9.4500000000000001E-2,9.4499999999999993,0.20599999999999999,206,0.14299999999999999,290,{"$f":"VLOOKUP(U622,'Powder Core Toroid OD'!$A$2:$B$36,2,FALSE)","v":9.65}]
[77310,"0077310A7",310,125,"Kool Mu",90,"Toroid",5.67,56.7,0.52500000000000002,13.3,0.93,23.7,0.33,8.39,0.317,31.7,1.8,1800,1.39,{"$f":"C623*1","v":310},{"$f":"VLOOKUP(U623,'Powder Core Toroid OD'!$A$2:$B$36,2,FALSE)","v":22.9}]
[77312,"0077312A7",310,26,"Kool Mu",19,"Toroid",5.67,56.7,0.52500000000000002,13.3,0.93,23.7,0.33,8.39,0.317,31.7,1.8,1800,1.39,310,{"$f":"VLOOKUP(U624,'Powder Core Toroid OD'!$A$2:$B$36,2,FALSE)","v":22.9}]
[77314,"0077314A7",310,90,"Kool Mu",65,"Toroid",5.67,56.7,0.52500000000000002,13.3,0.93,23.7,0.33,8.39,0.317,31.7,1.8,1800,1.39,310,{"$f":"VLOOKUP(U625,'Powder Core Toroid OD'!$A$2:$B$36,2,FALSE)","v":22.9}]
[77315,"0077315A7",310,75,"Kool Mu",54,"Toroid",5.67,56.7,0.52500000000000002,13.3,0.93,23.7,0.33,8.39,0.317,31.7,1.8,1800,1.39,310,{"$f":"VLOOKUP(U626,'Powder Core Toroid OD'!$A$2:$B$36,2,FALSE)","v":22.9}]
[77316,"0077316A7",310,40,"Kool Mu",29,"Toroid",5.67,56.7,0.52500000000000002,13.3,0.93,23.7,0.33,8.39,0.317,31.7,1.8,1800,1.39,310,{"$f":"VLOOKUP(U627,'Powder Core Toroid OD'!$A$2:$B$36,2,FALSE)","v":22.9}]
[77324,"0077324A7",324,125,"Kool Mu",117,"Toroid",8.98,89.800000000000011,0.84799999999999998,21.5,1.4450000000000001,36.71,0.44700000000000001,11.4,0.67800000000000005,67.800000000000011,6.09,6090,3.64,324,{"$f":"VLOOKUP(U628,'Powder Core Toroid OD'!$A$2:$B$36,2,FALSE)","v":35.799999999999997}]
[77326,"0077326A7",324,26,"Kool Mu",24,"Toroid",8.98,89.800000000000011,0.84799999999999998,21.5,1.4450000000000001,36.71,0.44700000000000001,11.4,0.67800000000000005,67.800000000000011,6.09,6090,3.64,324,{"$f":"VLOOKUP(U629,'Powder Core Toroid OD'!$A$2:$B$36,2,FALSE)","v":35.799999999999997}]
[77328,"0077328A7",324,90,"Kool Mu",84,"Toroid",8.98,89.800000000000011,0.84799999999999998,21.5,1.4450000000000001,36.71,0.44700000000000001,11.4,0.67800000000000005,67.800000000000011,6.09,6090,3.64,324,{"$f":"VLOOKUP(U630,'Powder Core Toroid OD'!$A$2:$B$36,2,FALSE)","v":35.799999999999997}]
[77329,"0077329A7",324,75,"Kool Mu",70,"Toroid",8.98,89.800000000000011,0.84799999999999998,21.5,1.4450000000000001,36.71,0.44700000000000001,11.4,0.67800000000000005,67.800000000000011,6.09,6090,3.64,324,{"$f":"VLOOKUP(U631,'Powder Core Toroid OD'!$A$2:$B$36,2,FALSE)","v":35.799999999999997}]
[77330,"0077330A7",324,40,"Kool Mu",37,"Toroid",8.98,89.800000000000011,0.84799999999999998,21.5,1.4450000000000001,36.71,0.44700000000000001,11.4,0.67800000000000005,67.800000000000011,6.09,6090,3.64,324,{"$f":"VLOOKUP(U632,'Powder Core Toroid OD'!$A$2:$B$36,2,FALSE)","v":35.799999999999997}]
[77334,"0077334A7",130,90,"Kool Mu",38,"Toroid",2.69,26.9,0.23,5.84,0.46500000000000002,11.9,0.18099999999999999,4.5999999999999996,9.06E-2,9.06,0.24399999999999999,244,0.26800000000000002,130,{"$f":"VLOOKUP(U633,'Powder Core Toroid OD'!$A$2:$B$36,2,FALSE)","v":11.2}]
[77335,"0077335A7",130,75,"Kool Mu",32,"Toroid",2.69,26.9,0.23,5.84,0.46500000000000002,11.9,0.18099999999999999,4.5999999999999996,9.06E-2,9.06,0.24399999999999999,244,0.26800000000000002,130,{"$f":"VLOOKUP(U634,'Powder Core Toroid OD'!$A$2:$B$36,2,FALSE)","v":11.2}]
[77350,"0077350A7",350,125,"Kool Mu",105,"Toroid",5.88,58.8,0.54200000000000004,13.7,0.95799999999999996,24.4,0.38,9.66,0.38800000000000001,38.800000000000004,2.2814399999999999,2280,1.49,350,{"$f":"VLOOKUP(U635,'Powder Core Toroid OD'!$A$2:$B$36,2,FALSE)","v":23.6}]
[77351,"0077351A7",350,60,"Kool Mu",51,"Toroid",5.88,58.8,0.54200000000000004,13.7,0.95799999999999996,24.4,0.38,9.66,0.38800000000000001,38.800000000000004,2.2814399999999999,2280,1.49,350,{"$f":"VLOOKUP(U636,'Powder Core Toroid OD'!$A$2:$B$36,2,FALSE)","v":23.6}]
[77352,"0077352A7",350,26,"Kool Mu",22,"Toroid",5.88,58.8,0.54200000000000004,13.7,0.95799999999999996,24.4,0.38,9.66,0.38800000000000001,38.800000000000004,2.2814399999999999,2280,1.49,350,{"$f":"VLOOKUP(U637,'Powder Core Toroid OD'!$A$2:$B$36,2,FALSE)","v":23.6}]
[77354,"0077354A7",350,90,"Kool Mu",76,"Toroid",5.88,58.8,0.54200000000000004,13.7,0.95799999999999996,24.4,0.38,9.66,0.38800000000000001,38.800000000000004,2.2814399999999999,2280,1.49,350,{"$f":"VLOOKUP(U638,'Powder Core Toroid OD'!$A$2:$B$36,2,FALSE)","v":23.6}]
[77355,"0077355A7",350,75,"Kool Mu",63,"Toroid",5.88,58.8,0.54200000000000004,13.7,0.95799999999999996,24.4,0.38,9.66,0.38800000000000001,38.800000000000004,2.2814399999999999,2280,1.49,350,{"$f":"VLOOKUP(U639,'Powder Core Toroid OD'!$A$2:$B$36,2,FALSE)","v":23.6}]
[77356,"0077356A7",350,40,"Kool Mu",34,"Toroid",5.88,58.8,0.54200000000000004,13.7,0.95799999999999996,24.4,0.38,9.66,0.38800000000000001,38.800000000000004,2.2814399999999999,2280,1.49,350,{"$f":"VLOOKUP(U640,'Powder Core Toroid OD'!$A$2:$B$36,2,FALSE)","v":23.6}]
[77380,"0077380A7",380,125,"Kool Mu",89,"Toroid",4.1399999999999997,41.4,0.35499999999999998,9.01,0.71,18.100000000000001,0.28000000000000003,7.12,0.23200000000000001,23.200000000000003,0.96,960,0.63800000000000001,380,{"$f":"VLOOKUP(U641,'Powder Core Toroid OD'!$A$2:$B$36,2,FALSE)","v":17.3}]
[77381,"0077381A7",380,60,"Kool Mu",43,"Toroid",4.1399999999999997,41.4,0.35499999999999998,9.01,0.71,18.100000000000001,0.28000000000000003,7.12,0.23200000000000001,23.200000000000003,0.96,960,0.63800000000000001,380,{"$f":"VLOOKUP(U642,'Powder Core Toroid OD'!$A$2:$B$36,2,FALSE)","v":17.3}]
[77384,"0077384A7",380,90,"Kool Mu",64,"Toroid",4.1399999999999997,41.4,0.35499999999999998,9.01,0.71,18.100000000000001,0.28000000000000003,7.12,0.23200000000000001,23.200000000000003,0.96,960,0.63800000000000001,380,{"$f":"VLOOKUP(U643,'Powder Core Toroid OD'!$A$2:$B$36,2,FALSE)","v":17.3}]
[77385,"0077385A7",380,75,"Kool Mu",53,"Toroid",4.1399999999999997,41.4,0.35499999999999998,9.01,0.71,18.100000000000001,0.28000000000000003,7.12,0.23200000000000001,23.200000000000003,0.96,960,0.63800000000000001,380,{"$f":"VLOOKUP(U644,'Powder Core Toroid OD'!$A$2:$B$36,2,FALSE)","v":17.3}]
[77410,"0077410A7",410,125,"Kool Mu",70,"Toroid",1.65,16.5,0.13600000000000001,3.45,0.29499999999999998,7.5,0.22500000000000001,5.72,7.2499999999999995E-2,7.2499999999999991,0.12,120,9.35E-2,410,{"$f":"VLOOKUP(U645,'Powder Core Toroid OD'!$A$2:$B$36,2,FALSE)","v":6.86}]
[77414,"0077414A7",410,90,"Kool Mu",50,"Toroid",1.65,16.5,0.13600000000000001,3.45,0.29499999999999998,7.5,0.22500000000000001,5.72,7.2499999999999995E-2,7.2499999999999991,0.12,120,9.35E-2,410,{"$f":"VLOOKUP(U646,'Powder Core Toroid OD'!$A$2:$B$36,2,FALSE)","v":6.86}]
[77431,"0077431A7",438,40,"Kool Mu",90,"Toroid",10.7,107,0.91800000000000004,23.3,1.875,47.63,0.745,19,1.99,199,21.3,21300,4.2699999999999996,438,{"$f":"VLOOKUP(U647,'Powder Core Toroid OD'!$A$2:$B$36,2,FALSE)","v":46.7}]
[77438,"0077438A7",438,125,"Kool Mu",281,"Toroid",10.7,107,0.91800000000000004,23.3,1.875,47.63,0.745,19,1.99,199,21.3,21300,4.2699999999999996,438,{"$f":"VLOOKUP(U648,'Powder Core Toroid OD'!$A$2:$B$36,2,FALSE)","v":46.7}]
[77439,"0077439A7",438,60,"Kool Mu",135,"Toroid",10.7,107,0.91800000000000004,23.3,1.875,47.63,0.745,19,1.99,199,21.3,21300,4.2699999999999996,438,{"$f":"VLOOKUP(U649,'Powder Core Toroid OD'!$A$2:$B$36,2,FALSE)","v":46.7}]
[77440,"0077440A7",438,26,"Kool Mu",59,"Toroid",10.7,107,0.91800000000000004,23.3,1.875,47.63,0.745,19,1.99,199,21.3,21300,4.2699999999999996,438,{"$f":"VLOOKUP(U650,'Powder Core Toroid OD'!$A$2:$B$36,2,FALSE)","v":46.7}]
[77442,"0077442A7",438,90,"Kool Mu",202,"Toroid",10.7,107,0.91800000000000004,23.3,1.875,47.63,0.745,19,1.99,199,21.3,21300,4.2699999999999996,438,{"$f":"VLOOKUP(U651,'Powder Core Toroid OD'!$A$2:$B$36,2,FALSE)","v":46.7}]
[77443,"0077443A7",438,75,"Kool Mu",169,"Toroid",10.7,107,0.91800000000000004,23.3,1.875,47.63,0.745,19,1.99,199,21.3,21300,4.2699999999999996,438,{"$f":"VLOOKUP(U652,'Powder Core Toroid OD'!$A$2:$B$36,2,FALSE)","v":46.7}]
[77444,"0077444A7",140,90,"Kool Mu",19,"Toroid",0.80600000000000005,8.06,0.05,1.27,0.16500000000000001,4.2,8.5000000000000006E-2,2.16,1.2999999999999999E-2,1.3,1.0500000000000001E-2,10.5,1.2699999999999999E-2,140,{"$f":"VLOOKUP(U653,'Powder Core Toroid OD'!$A$2:$B$36,2,FALSE)","v":3.56}]
[77445,"0077445A7",140,75,"Kool Mu",16,"Toroid",0.80600000000000005,8.06,0.05,1.27,0.16500000000000001,4.2,8.5000000000000006E-2,2.16,1.2999999999999999E-2,1.3,1.0500000000000001E-2,10.5,1.2699999999999999E-2,140,{"$f":"VLOOKUP(U654,'Powder Core Toroid OD'!$A$2:$B$36,2,FALSE)","v":3.56}]
[77548,"0077548A7",548,125,"Kool Mu",127,"Toroid",8.14,81.400000000000006,0.76600000000000001,19.399999999999999,1.325,33.659999999999997,0.45,11.5,0.65600000000000003,65.599999999999994,5.34,5340,2.97,548,{"$f":"VLOOKUP(U655,'Powder Core Toroid OD'!$A$2:$B$36,2,FALSE)","v":32.799999999999997}]
[77550,"0077550A7",548,26,"Kool Mu",28,"Toroid",8.14,81.400000000000006,0.76600000000000001,19.399999999999999,1.325,33.659999999999997,0.45,11.5,0.65600000000000003,65.599999999999994,5.34,5340,2.97,548,{"$f":"VLOOKUP(U656,'Powder Core Toroid OD'!$A$2:$B$36,2,FALSE)","v":32.799999999999997}]
[77552,"0077552A7",548,90,"Kool Mu",91,"Toroid",8.14,81.400000000000006,0.76600000000000001,19.399999999999999,1.325,33.659999999999997,0.45,11.5,0.65600000000000003,65.599999999999994,5.34,5340,2.97,548,{"$f":"VLOOKUP(U657,'Powder Core Toroid OD'!$A$2:$B$36,2,FALSE)","v":32.799999999999997}]
[77553,"0077553A7",548,75,"Kool Mu",76,"Toroid",8.14,81.400000000000006,0.76600000000000001,19.399999999999999,1.325,33.659999999999997,0.45,11.5,0.65600000000000003,65.599999999999994,5.34,5340,2.97,548,{"$f":"VLOOKUP(U658,'Powder Core Toroid OD'!$A$2:$B$36,2,FALSE)","v":32.799999999999997}]
[77555,"0077555A7",548,40,"Kool Mu",41,"Toroid",8.14,81.400000000000006,0.76600000000000001,19.399999999999999,1.325,33.659999999999997,0.45,11.5,0.65600000000000003,65.599999999999994,5.34,5340,2.97,548,{"$f":"VLOOKUP(U659,'Powder Core Toroid OD'!$A$2:$B$36,2,FALSE)","v":32.799999999999997}]
[77585,"0077585A7",585,125,"Kool Mu",79,"Toroid",8.9499999999999993,89.5,0.88800000000000001,22.5,1.385,35.18,0.38500000000000001,9.7799999999999994,0.46400000000000002,46.4,4.1500000000000004,4150,3.99,585,{"$f":"VLOOKUP(U660,'Powder Core Toroid OD'!$A$2:$B$36,2,FALSE)","v":34.299999999999997}]
[77586,"0077586A7",585,60,"Kool Mu",38,"Toroid",8.9499999999999993,89.5,0.88800000000000001,22.5,1.385,35.18,0.38500000000000001,9.7799999999999994,0.46400000000000002,46.4,4.1500000000000004,4150,3.99,585,{"$f":"VLOOKUP(U661,'Powder Core Toroid OD'!$A$2:$B$36,2,FALSE)","v":34.299999999999997}]
[77587,"0077587A7",585,26,"Kool Mu",16,"Toroid",8.9499999999999993,89.5,0.88800000000000001,22.5,1.385,35.18,0.38500000000000001,9.7799999999999994,0.46400000000000002,46.4,4.1500000000000004,4150,3.99,585,{"$f":"VLOOKUP(U662,'Powder Core Toroid OD'!$A$2:$B$36,2,FALSE)","v":34.299999999999997}]
[77589,"0077589A7",585,90,"Kool Mu",57,"Toroid",8.9499999999999993,89.5,0.88800000000000001,22.5,1.385,35.18,0.38500000000000001,9.7799999999999994,0.46400000000000002,46.4,4.1500000000000004,4150,3.99,585,{"$f":"VLOOKUP(U663,'Powder Core Toroid OD'!$A$2:$B$36,2,FALSE)","v":34.299999999999997}]
[77590,"0077590A7",585,75,"Kool Mu",47,"Toroid",8.9499999999999993,89.5,0.88800000000000001,22.5,1.385,35.18,0.38500000000000001,9.7799999999999994,0.46400000000000002,46.4,4.1500000000000004,4150,3.99,585,{"$f":"VLOOKUP(U664,'Powder Core Toroid OD'!$A$2:$B$36,2,FALSE)","v":34.299999999999997}]
[77591,"0077591A7",585,40,"Kool Mu",25,"Toroid",8.9499999999999993,89.5,0.88800000000000001,22.5,1.385,35.18,0.38500000000000001,9.7799999999999994,0.46400000000000002,46.4,4.1500000000000004,4150,3.99,585,{"$f":"VLOOKUP(U665,'Powder Core Toroid OD'!$A$2:$B$36,2,FALSE)","v":34.299999999999997}]
[77715,"0077715A7",715,125,"Kool Mu",152,"Toroid",12.7,127,1.218,30.93,2.0350000000000001,51.69,0.56500000000000006,14.4,1.25,125,15.9,15900,7.51,715,{"$f":"VLOOKUP(U666,'Powder Core Toroid OD'!$A$2:$B$36,2,FALSE)","v":50.8}]
[77716,"0077716A7",715,60,"Kool Mu",73,"Toroid",12.7,127,1.218,30.93,2.0350000000000001,51.69,0.56500000000000006,14.4,1.25,125,15.9,15900,7.51,715,{"$f":"VLOOKUP(U667,'Powder Core Toroid OD'!$A$2:$B$36,2,FALSE)","v":50.8}]
[77717,"0077717A7",715,26,"Kool Mu",32,"Toroid",12.7,127,1.218,30.93,2.0350000000000001,51.69,0.56500000000000006,14.4,1.25,125,15.9,15900,7.51,715,{"$f":"VLOOKUP(U668,'Powder Core Toroid OD'!$A$2:$B$36,2,FALSE)","v":50.8}]
[77719,"0077719A7",715,90,"Kool Mu",109,"Toroid",12.7,127,1.218,30.93,2.0350000000000001,51.69,0.56500000000000006,14.4,1.25,125,15.9,15900,7.51,715,{"$f":"VLOOKUP(U669,'Powder Core Toroid OD'!$A$2:$B$36,2,FALSE)","v":50.8}]
[77720,"0077720A7",715,75,"Kool Mu",91,"Toroid",12.7,127,1.218,30.93,2.0350000000000001,51.69,0.56500000000000006,14.4,1.25,125,15.9,15900,7.51,715,{"$f":"VLOOKUP(U670,'Powder Core Toroid OD'!$A$2:$B$36,2,FALSE)","v":50.8}]
[77721,"0077721A7",715,40,"Kool Mu",49,"Toroid",12.7,127,1.218,30.93,2.0350000000000001,51.69,0.56500000000000006,14.4,1.25,125,15.9,15900,7.51,715,{"$f":"VLOOKUP(U671,'Powder Core Toroid OD'!$A$2:$B$36,2,FALSE)","v":50.8}]
[77824,"0077824A7","020",90,"Kool Mu",36,"Toroid",1.36,13.6,0.09,2.2799999999999998,0.27500000000000002,6.99,0.13500000000000001,3.43,4.7E-2,4.7,6.4000000000000001E-2,64,4.0800000000000003E-2,20,{"$f":"VLOOKUP(U672,'Powder Core Toroid OD'!$A$2:$B$36,2,FALSE)","v":6.35}]
[77825,"0077825A7","020",75,"Kool Mu",30,"Toroid",1.36,13.6,0.09,2.2799999999999998,0.27500000000000002,6.99,0.13500000000000001,3.43,4.7E-2,4.7,6.4000000000000001E-2,64,4.0800000000000003E-2,20,{"$f":"VLOOKUP(U673,'Powder Core Toroid OD'!$A$2:$B$36,2,FALSE)","v":6.35}]
[77834,"0077834A7","030",90,"Kool Mu",37,"Toroid",1.79,17.899999999999999,0.13600000000000001,3.45,0.33500000000000002,8.51,0.15,3.8099999999999996,5.9900000000000002E-2,5.99,0.107,107,9.35E-2,30,{"$f":"VLOOKUP(U674,'Powder Core Toroid OD'!$A$2:$B$36,2,FALSE)","v":7.87}]
[77835,"0077835A7","030",75,"Kool Mu",31,"Toroid",1.79,17.899999999999999,0.13600000000000001,3.45,0.33500000000000002,8.51,0.15,3.8099999999999996,5.9900000000000002E-2,5.99,0.107,107,9.35E-2,30,{"$f":"VLOOKUP(U675,'Powder Core Toroid OD'!$A$2:$B$36,2,FALSE)","v":7.87}]
[77844,"0077844A7","040",90,"Kool Mu",48,"Toroid",2.2999999999999998,23,0.18,4.57,0.42499999999999999,10.8,0.18099999999999999,4.5999999999999996,9.5699999999999993E-2,9.5699999999999985,0.22,220,0.16400000000000001,40,{"$f":"VLOOKUP(U676,'Powder Core Toroid OD'!$A$2:$B$36,2,FALSE)","v":10.199999999999999}]
[77847,"0077847A7",206,40,"Kool Mu",21,"Toroid",5.09,50.9,0.47500000000000003,12,0.83,21.1,0.28000000000000003,7.12,0.221,22.1,1.1200000000000001,1120,1.1399999999999999,206,{"$f":"VLOOKUP(U677,'Powder Core Toroid OD'!$A$2:$B$36,2,FALSE)","v":20.3}]
[77848,"0077848A7",206,60,"Kool Mu",32,"Toroid",5.09,50.9,0.47500000000000003,12,0.83,21.1,0.28000000000000003,7.12,0.221,22.1,1.1200000000000001,1120,1.1399999999999999,206,{"$f":"VLOOKUP(U678,'Powder Core Toroid OD'!$A$2:$B$36,2,FALSE)","v":20.3}]
[77867,"0077867A7",866,60,"Kool Mu",68,"Toroid",19.600000000000001,196,1.8979999999999999,48.2,3.1080000000000001,78.95,0.54500000000000004,13.9,1.76,176,34.5,34500,18.2,866,{"$f":"VLOOKUP(U679,'Powder Core Toroid OD'!$A$2:$B$36,2,FALSE)","v":77.8}]
[77868,"0077868A7",866,26,"Kool Mu",30,"Toroid",19.600000000000001,196,1.8979999999999999,48.2,3.1080000000000001,78.95,0.54500000000000004,13.9,1.76,176,34.5,34500,18.2,866,{"$f":"VLOOKUP(U680,'Powder Core Toroid OD'!$A$2:$B$36,2,FALSE)","v":77.8}]
[77872,"0077872A7",866,40,"Kool Mu",45,"Toroid",19.600000000000001,196,1.8979999999999999,48.2,3.1080000000000001,78.95,0.54500000000000004,13.9,1.76,176,34.5,34500,18.2,866,{"$f":"VLOOKUP(U681,'Powder Core Toroid OD'!$A$2:$B$36,2,FALSE)","v":77.8}]
[77874,"0077874A7",270,90,"Kool Mu",74,"Toroid",1.36,13.6,8.5000000000000006E-2,2.15,0.28500000000000003,7.24,0.21299999999999999,5.42,9.1999999999999998E-2,9.1999999999999993,0.125,125,3.6299999999999999E-2,270,{"$f":"VLOOKUP(U682,'Powder Core Toroid OD'!$A$2:$B$36,2,FALSE)","v":6.6}]
[77875,"0077875A7",270,75,"Kool Mu",62,"Toroid",1.36,13.6,8.5000000000000006E-2,2.15,0.28500000000000003,7.24,0.21299999999999999,5.42,9.1999999999999998E-2,9.1999999999999993,0.125,125,3.6299999999999999E-2,270,{"$f":"VLOOKUP(U683,'Powder Core Toroid OD'!$A$2:$B$36,2,FALSE)","v":6.6}]
[77884,"0077884A7",280,90,"Kool Mu",38,"Toroid",2.1800000000000002,21.8,0.16800000000000001,4.26,0.40500000000000003,10.3,0.15,3.8099999999999996,7.5200000000000003E-2,7.52,0.16400000000000001,164,0.14299999999999999,280,{"$f":"VLOOKUP(U684,'Powder Core Toroid OD'!$A$2:$B$36,2,FALSE)","v":9.65}]
[77885,"0077885A7",280,75,"Kool Mu",32,"Toroid",2.1800000000000002,21.8,0.16800000000000001,4.26,0.40500000000000003,10.3,0.15,3.8099999999999996,7.5200000000000003E-2,7.52,0.16400000000000001,164,0.14299999999999999,280,{"$f":"VLOOKUP(U685,'Powder Core Toroid OD'!$A$2:$B$36,2,FALSE)","v":9.65}]
[77894,"0077894A7",930,60,"Kool Mu",75,"Toroid",6.35,63.5,0.55500000000000005,14.1,1.0900000000000001,27.69,0.47,12,0.65400000000000003,65.400000000000006,4.1500000000000004,4150,1.56,930,{"$f":"VLOOKUP(U686,'Powder Core Toroid OD'!$A$2:$B$36,2,FALSE)","v":26.9}]
[77906,"0077906A7",906,125,"Kool Mu",177,"Toroid",19.600000000000001,196,1.8979999999999999,48.2,3.1080000000000001,78.95,0.67,17.100000000000001,2.21,221,43.4,43400,18.2,{"$f":"C687*1","v":906},{"$f":"VLOOKUP(U687,'Powder Core Toroid OD'!$A$2:$B$36,2,FALSE)","v":77.8}]
[77907,"0077907A7",906,60,"Kool Mu",85,"Toroid",19.600000000000001,196,1.8979999999999999,48.2,3.1080000000000001,78.95,0.67,17.100000000000001,2.21,221,43.4,43400,18.2,906,{"$f":"VLOOKUP(U688,'Powder Core Toroid OD'!$A$2:$B$36,2,FALSE)","v":77.8}]
[77908,"0077908A7",906,26,"Kool Mu",37,"Toroid",19.600000000000001,196,1.8979999999999999,48.2,3.1080000000000001,78.95,0.67,17.100000000000001,2.21,221,43.4,43400,18.2,906,{"$f":"VLOOKUP(U689,'Powder Core Toroid OD'!$A$2:$B$36,2,FALSE)","v":77.8}]
[77912,"0077912A7",906,40,"Kool Mu",57,"Toroid",19.600000000000001,196,1.8979999999999999,48.2,3.1080000000000001,78.95,0.67,17.100000000000001,2.21,221,43.4,43400,18.2,906,{"$f":"VLOOKUP(U690,'Powder Core Toroid OD'!$A$2:$B$36,2,FALSE)","v":77.8}]
[77930,"0077930A7",930,125,"Kool Mu",157,"Toroid",6.35,63.5,0.55500000000000005,14.1,1.0900000000000001,27.69,0.47,12,0.65400000000000003,65.400000000000006,4.1500000000000004,4150,1.56,930,{"$f":"VLOOKUP(U691,'Powder Core Toroid OD'!$A$2:$B$36,2,FALSE)","v":26.9}]
[77932,"0077932A7",930,26,"Kool Mu",32,"Toroid",6.35,63.5,0.55500000000000005,14.1,1.0900000000000001,27.69,0.47,12,0.65400000000000003,65.400000000000006,4.1500000000000004,4150,1.56,930,{"$f":"VLOOKUP(U692,'Powder Core Toroid OD'!$A$2:$B$36,2,FALSE)","v":26.9}]
[77934,"0077934A7",930,90,"Kool Mu",113,"Toroid",6.35,63.5,0.55500000000000005,14.1,1.0900000000000001,27.69,0.47,12,0.65400000000000003,65.400000000000006,4.1500000000000004,4150,1.56,930,{"$f":"VLOOKUP(U693,'Powder Core Toroid OD'!$A$2:$B$36,2,FALSE)","v":26.9}]
[77935,"0077935A7",930,75,"Kool Mu",94,"Toroid",6.35,63.5,0.55500000000000005,14.1,1.0900000000000001,27.69,0.47,12,0.65400000000000003,65.400000000000006,4.1500000000000004,4150,1.56,930,{"$f":"VLOOKUP(U694,'Powder Core Toroid OD'!$A$2:$B$36,2,FALSE)","v":26.9}]
[77936,"0077936A7",930,40,"Kool Mu",50,"Toroid",6.35,63.5,0.55500000000000005,14.1,1.0900000000000001,27.69,0.47,12,0.65400000000000003,65.400000000000006,4.1500000000000004,4150,1.56,930,{"$f":"VLOOKUP(U695,'Powder Core Toroid OD'!$A$2:$B$36,2,FALSE)","v":26.9}]
[78051,"0078051A7","050",60,"XFlux",27,"Toroid",3.12,31.200000000000003,0.27500000000000002,6.98,0.53,13.5,0.217,5.52,0.109,10.9,0.34,340,0.38300000000000001,50,{"$f":"VLOOKUP(U696,'Powder Core Toroid OD'!$A$2:$B$36,2,FALSE)","v":12.7}]
[78059,"0078059A7",310,60,"XFlux",43,"Toroid",5.67,56.7,0.52500000000000002,13.3,0.93,23.7,0.33,8.39,0.317,31.7,1.8,1800,1.39,310,{"$f":"VLOOKUP(U697,'Powder Core Toroid OD'!$A$2:$B$36,2,FALSE)","v":22.9}]
[78071,"0078071A7",548,60,"XFlux",61,"Toroid",8.14,81.400000000000006,0.76600000000000001,19.399999999999999,1.325,33.659999999999997,0.45,11.5,0.65600000000000003,65.599999999999994,5.34,5340,2.97,548,{"$f":"VLOOKUP(U698,'Powder Core Toroid OD'!$A$2:$B$36,2,FALSE)","v":32.799999999999997}]
[78076,"0078076A7",324,60,"XFlux",56,"Toroid",8.98,89.800000000000011,0.84799999999999998,21.5,1.4450000000000001,36.71,0.44700000000000001,11.4,0.67800000000000005,67.800000000000011,6.09,6090,3.64,324,{"$f":"VLOOKUP(U699,'Powder Core Toroid OD'!$A$2:$B$36,2,FALSE)","v":35.799999999999997}]
[78083,"0078083A7",254,60,"XFlux",81,"Toroid",9.84,98.4,0.91800000000000004,23.3,1.605,40.770000000000003,0.60499999999999998,15.4,1.07,107,10.6,10600,4.2699999999999996,254,{"$f":"VLOOKUP(U700,'Powder Core Toroid OD'!$A$2:$B$36,2,FALSE)","v":39.9}]
[78090,"0078090A7","089",60,"XFlux",86,"Toroid",11.6,116,1.0980000000000001,27.88,1.875,47.63,0.63500000000000001,16.100000000000001,1.34,134,15.6,15600,6.1,89,{"$f":"VLOOKUP(U701,'Powder Core Toroid OD'!$A$2:$B$36,2,FALSE)","v":46.7}]
[78110,"0078110A7",109,60,"XFlux",75,"Toroid",14.3,143,1.3680000000000001,34.74,2.2850000000000001,58.04,0.58499999999999996,14.9,1.44,144,20.7,20700,9.48,109,{"$f":"VLOOKUP(U702,'Powder Core Toroid OD'!$A$2:$B$36,2,FALSE)","v":57.2}]
[78121,"0078121A7",120,60,"XFlux",35,"Toroid",4.12,41.2,0.375,9.52,0.68,17.3,0.28000000000000003,7.12,0.192,19.2,0.79100000000000004,791,0.71199999999999997,120,{"$f":"VLOOKUP(U703,'Powder Core Toroid OD'!$A$2:$B$36,2,FALSE)","v":16.600000000000001}]
[78192,"0078192A7",195,60,"XFlux",138,"Toroid",12.5,125,1.0069999999999999,25.57,2.2850000000000001,58.04,0.63500000000000001,16.2,2.29,229,28.6,28600,5.14,195,{"$f":"VLOOKUP(U704,'Powder Core Toroid OD'!$A$2:$B$36,2,FALSE)","v":57.2}]
[78351,"0078351A7",350,60,"XFlux",51,"Toroid",5.88,58.8,0.54200000000000004,13.7,0.95799999999999996,24.4,0.38,9.66,0.38800000000000001,38.800000000000004,2.2814399999999999,2280,1.49,350,{"$f":"VLOOKUP(U705,'Powder Core Toroid OD'!$A$2:$B$36,2,FALSE)","v":23.6}]
[78381,"0078381A7",380,60,"XFlux",43,"Toroid",4.1399999999999997,41.4,0.35499999999999998,9.01,0.71,18.100000000000001,0.28000000000000003,7.12,0.23200000000000001,23.200000000000003,0.96048,960,0.63800000000000001,380,{"$f":"VLOOKUP(U706,'Powder Core Toroid OD'!$A$2:$B$36,2,FALSE)","v":17.3}]
[78439,"0078439A7",438,60,"XFlux",135,"Toroid",10.7,107,0.91800000000000004,23.3,1.875,47.63,0.745,19,1.99,199,21.3,21300,4.2699999999999996,438,{"$f":"VLOOKUP(U707,'Powder Core Toroid OD'!$A$2:$B$36,2,FALSE)","v":46.7}]
[78586,"0078586A7",585,60,"XFlux",38,"Toroid",8.9499999999999993,89.5,0.88800000000000001,22.5,1.385,35.18,0.38500000000000001,9.7799999999999994,0.46400000000000002,46.4,4.1500000000000004,4150,3.99,585,{"$f":"VLOOKUP(U708,'Powder Core Toroid OD'!$A$2:$B$36,2,FALSE)","v":34.299999999999997}]
[78716,"0078716A7",715,60,"XFlux",73,"Toroid",12.7,127,1.218,30.93,2.0350000000000001,51.69,0.56500000000000006,14.4,1.25,125,15.9,15900,7.51,715,{"$f":"VLOOKUP(U709,'Powder Core Toroid OD'!$A$2:$B$36,2,FALSE)","v":50.8}]
[78848,"0078848A7",206,60,"XFlux",32,"Toroid",5.09,50.9,0.47500000000000003,12,0.83,21.1,0.28000000000000003,7.12,0.221,22.1,1.1200000000000001,1120,1.1399999999999999,206,{"$f":"VLOOKUP(U710,'Powder Core Toroid OD'!$A$2:$B$36,2,FALSE)","v":20.3}]
[78867,"0078867A7",866,60,"XFlux",68,"Toroid",19.600000000000001,196,1.8979999999999999,48.2,3.1080000000000001,78.95,0.54500000000000004,13.9,1.76,176,34.5,34500,18.2,866,{"$f":"VLOOKUP(U711,'Powder Core Toroid OD'!$A$2:$B$36,2,FALSE)","v":77.8}]
[78894,"0078894A7",930,60,"XFlux",75,"Toroid",6.35,63.5,0.55500000000000005,14.1,1.0900000000000001,27.69,0.47,12,0.65400000000000003,65.400000000000006,4.1500000000000004,4150,1.56,930,{"$f":"VLOOKUP(U712,'Powder Core Toroid OD'!$A$2:$B$36,2,FALSE)","v":26.9}]
[78907,"0078907A7",906,60,"XFlux",85,"Toroid",19.600000000000001,196,1.8979999999999999,48.2,3.1080000000000001,78.95,0.67,17.100000000000001,2.21,221,43.4,43400,18.2,906,{"$f":"VLOOKUP(U713,'Powder Core Toroid OD'!$A$2:$B$36,2,FALSE)","v":77.8}]
[8020,"00K8020U026","8020",26,"Kool Mu",64,"U Core",27.3,273,1.5249999999999999,38.74,3.1850000000000001,80.900000000000006,0.79500000000000004,20.2,1.9500000000000002,195.00000000000003,53.2,53200]
[8020,"00K8020E026","8020",26,"Kool Mu",103,"E Core",18.5,185,1.5249999999999999,38.74,3.1970000000000001,81.209999999999994,0.79500000000000004,20.2,3.89,389,72,72000]
[8020,"00K8020E040","8020",40,"Kool Mu",145,"E Core",18.5,185,1.5249999999999999,38.74,3.1970000000000001,81.209999999999994,0.79500000000000004,20.2,3.89,389,72,72000]
[8020,"00K8020E060","8020",60,"Kool Mu",190,"E Core",18.5,185,1.5249999999999999,38.74,3.1970000000000001,81.209999999999994,0.79500000000000004,20.2,3.89,389,72,72000]
[8038,"00K8038U026","8038",26,"Kool Mu",97,"U Core",23.7,237,1.5249999999999999,38.74,3.1850000000000001,80.900000000000006,0.92200000000000004,23.4,3.54,354,83.9,83900]
[8038,"00K8038U060","8038",60,"Kool Mu",179,"U Core",23.7,237,1.5249999999999999,38.74,3.1850000000000001,80.900000000000006,0.92200000000000004,23.4,3.54,354,83.9,83900]
[8044,"00K8044E026","8044",26,"Kool Mu",91,"E Core",20.8,208,1.78,45.21,3.1970000000000001,81.2,0.79500000000000004,20.2,3.89,389,80.900000000000006,80900]
[77166,"0077166A7",165,40,"Kool Mu",120,"Toroid",41.2,412,3.9769999999999999,101,6.5549999999999997,166.5,1.3049999999999999,33.15,9.8699999999999992,987,407,407000,80.3,{"$f":"C721*1","v":165},{"$f":"VLOOKUP(U721,'Powder Core Toroid OD'!$A$2:$B$36,2,FALSE)","v":165.1}]
[77155,"0077155A7",150,75,"Kool Mu",21,"Toroid",0.94199999999999995,9.42,6.8000000000000005E-2,1.72,0.18,4.58,0.125,3.18,2.1100000000000001E-2,2.11,1.9900000000000001E-2,19.899999999999999,2.3199999999999998E-2,150,{"$f":"VLOOKUP(U722,'Powder Core Toroid OD'!$A$2:$B$36,2,FALSE)","v":3.94}]
[77185,"0077185A7",180,75,"Kool Mu",25,"Toroid",1.06,10.6,7.2999999999999995E-2,1.85,0.20799999999999999,5.29,0.125,3.18,2.8500000000000001E-2,2.85,3.0300000000000001E-2,30.3,2.69E-2,180,{"$f":"VLOOKUP(U723,'Powder Core Toroid OD'!$A$2:$B$36,2,FALSE)","v":4.6500000000000004}]
[55016,"C055016A2","020",550,"MPP",220,"Toroid",1.36,13.6,0.09,2.2799999999999998,0.27500000000000002,6.99,0.13500000000000001,3.43,4.7E-2,4.7,6.4000000000000001E-2,64,4.0800000000000003E-2,20,{"$f":"VLOOKUP(U724,'Powder Core Toroid OD'!$A$2:$B$36,2,FALSE)","v":6.35}]
[58022,"0058022A2","020",26,"High Flux",10,"Toroid",1.36,13.6,0.09,2.2799999999999998,0.27500000000000002,6.99,0.13500000000000001,3.43,4.7E-2,4.7,6.4000000000000001E-2,64,4.0800000000000003E-2,20,{"$f":"VLOOKUP(U725,'Powder Core Toroid OD'!$A$2:$B$36,2,FALSE)","v":6.35}]
[58242,"0058242A2",240,26,"High FLux",11,"Toroid",1.36,13.6,8.5000000000000006E-2,2.15,0.28499999999999998,7.24,0.125,3.18,4.7600000000000003E-2,4.7600000000000007,6.4899999999999999E-2,64.900000000000006,3.6299999999999999E-2,240,{"$f":"VLOOKUP(U726,'Powder Core Toroid OD'!$A$2:$B$36,2,FALSE)","v":6.6}]
[77241,"0077241A7",240,60,"Kool Mu",26,"Toroid",1.36,13.6,8.5000000000000006E-2,2.15,0.28499999999999998,7.24,0.125,3.18,4.7600000000000003E-2,4.7600000000000007,6.4899999999999999E-2,64.900000000000006,3.6299999999999999E-2,240,{"$f":"VLOOKUP(U727,'Powder Core Toroid OD'!$A$2:$B$36,2,FALSE)","v":6.6}]
[77245,"0077245A7",240,75,"Kool Mu",32,"Toroid",1.36,13.6,8.5000000000000006E-2,2.15,0.28499999999999998,7.24,0.125,3.18,4.7600000000000003E-2,4.7600000000000007,6.4899999999999999E-2,64.900000000000006,3.6299999999999999E-2,240,{"$f":"VLOOKUP(U728,'Powder Core Toroid OD'!$A$2:$B$36,2,FALSE)","v":6.6}]
[55273,"0055273A2",270,14,"MPP",12,"Toroid",1.36,13.6,8.5000000000000006E-2,2.15,0.28500000000000003,7.24,0.21299999999999999,5.42,9.1999999999999998E-2,9.1999999999999993,0.125,125,3.6299999999999999E-2,270,{"$f":"VLOOKUP(U729,'Powder Core Toroid OD'!$A$2:$B$36,2,FALSE)","v":6.6}]
[58269,"C058269A2",270,147,"High Flux",122,"Toroid",1.36,13.6,8.5000000000000006E-2,2.15,0.28500000000000003,7.24,0.21299999999999999,5.42,9.1999999999999998E-2,9.1999999999999993,0.125,125,3.6299999999999999E-2,270,{"$f":"VLOOKUP(U730,'Powder Core Toroid OD'!$A$2:$B$36,2,FALSE)","v":6.6}]
[58272,"0058272A2",270,26,"High Flux",21,"Toroid",1.36,13.6,8.5000000000000006E-2,2.15,0.28500000000000003,7.24,0.21299999999999999,5.42,9.1999999999999998E-2,9.1999999999999993,0.125,125,3.6299999999999999E-2,270,{"$f":"VLOOKUP(U731,'Powder Core Toroid OD'!$A$2:$B$36,2,FALSE)","v":6.6}]
[55412,"0055412A2",410,26,"MPP",14,"Toroid",1.65,16.5,0.13600000000000001,3.45,0.29499999999999998,7.5,0.22500000000000001,5.72,7.2499999999999995E-2,7.2499999999999991,0.12,120,9.35E-2,410,{"$f":"VLOOKUP(U732,'Powder Core Toroid OD'!$A$2:$B$36,2,FALSE)","v":6.86}]
[55413,"0055413A2",410,14,"MPP",8,"Toroid",1.65,16.5,0.13600000000000001,3.45,0.29499999999999998,7.5,0.22500000000000001,5.72,7.2499999999999995E-2,7.2499999999999991,0.12,120,9.35E-2,410,{"$f":"VLOOKUP(U733,'Powder Core Toroid OD'!$A$2:$B$36,2,FALSE)","v":6.86}]
[58409,"C058409A2",410,147,"High Flux",81,"Toroid",1.65,16.5,0.13600000000000001,3.45,0.29499999999999998,7.5,0.22500000000000001,5.72,7.2499999999999995E-2,7.2499999999999991,0.12,120,9.35E-2,410,{"$f":"VLOOKUP(U734,'Powder Core Toroid OD'!$A$2:$B$36,2,FALSE)","v":6.86}]
[58411,"C058411A2",410,60,"High Flux",33,"Toroid",1.65,16.5,0.13600000000000001,3.45,0.29499999999999998,7.5,0.22500000000000001,5.72,7.2499999999999995E-2,7.2499999999999991,0.12,120,9.35E-2,410,{"$f":"VLOOKUP(U735,'Powder Core Toroid OD'!$A$2:$B$36,2,FALSE)","v":6.86}]
[58412,"0058412A2",410,26,"High Flux",14,"Toroid",1.65,16.5,0.13600000000000001,3.45,0.29499999999999998,7.5,0.22500000000000001,5.72,7.2499999999999995E-2,7.2499999999999991,0.12,120,9.35E-2,410,{"$f":"VLOOKUP(U736,'Powder Core Toroid OD'!$A$2:$B$36,2,FALSE)","v":6.86}]
[58413,"0058413A2",410,14,"High Flux",8,"Toroid",1.65,16.5,0.13600000000000001,3.45,0.29499999999999998,7.5,0.22500000000000001,5.72,7.2499999999999995E-2,7.2499999999999991,0.12,120,9.35E-2,410,{"$f":"VLOOKUP(U737,'Powder Core Toroid OD'!$A$2:$B$36,2,FALSE)","v":6.86}]
[77411,"0077411A7",410,60,"Kool Mu",33,"Toroid",1.65,16.5,0.13600000000000001,3.45,0.29499999999999998,7.5,0.22500000000000001,5.72,7.2499999999999995E-2,7.2499999999999991,0.12,120,9.35E-2,410,{"$f":"VLOOKUP(U738,'Powder Core Toroid OD'!$A$2:$B$36,2,FALSE)","v":6.86}]
[77415,"0077415A7",410,75,"Kool Mu",42,"Toroid",1.65,16.5,0.13600000000000001,3.45,0.29499999999999998,7.5,0.22500000000000001,5.72,7.2499999999999995E-2,7.2499999999999991,0.12,120,9.35E-2,410,{"$f":"VLOOKUP(U739,'Powder Core Toroid OD'!$A$2:$B$36,2,FALSE)","v":6.86}]
[55026,"C055026A2","030",550,"MPP",226,"Toroid",1.79,17.899999999999999,0.13600000000000001,3.45,0.33500000000000002,8.51,0.15,3.8099999999999996,5.9900000000000002E-2,5.99,0.107,107,9.35E-2,30,{"$f":"VLOOKUP(U740,'Powder Core Toroid OD'!$A$2:$B$36,2,FALSE)","v":7.87}]
[58283,"0058283A2",280,14,"High Flux",6,"Toroid",2.1800000000000002,21.8,0.16800000000000001,4.26,0.40500000000000003,10.3,0.15,3.8099999999999996,7.5200000000000003E-2,7.52,0.16400000000000001,164,0.14299999999999999,280,{"$f":"VLOOKUP(U741,'Powder Core Toroid OD'!$A$2:$B$36,2,FALSE)","v":9.65}]
[77295,"0077295A7",290,60,"Kool Mu",32,"Toroid",2.1800000000000002,21.8,0.16800000000000001,4.26,0.40500000000000003,10.3,0.18099999999999999,4.5999999999999996,9.4500000000000001E-2,9.4499999999999993,0.20599999999999999,206,0.14299999999999999,290,{"$f":"VLOOKUP(U742,'Powder Core Toroid OD'!$A$2:$B$36,2,FALSE)","v":9.65}]
[58043,"0058043A2","040",14,"High Flux",7,"Toroid",2.2999999999999998,23,0.18,4.57,0.42499999999999999,10.8,0.18099999999999999,4.5999999999999996,9.5699999999999993E-2,9.5699999999999985,0.22,220,0.16400000000000001,40,{"$f":"VLOOKUP(U743,'Powder Core Toroid OD'!$A$2:$B$36,2,FALSE)","v":10.199999999999999}]
[77845,"0077845A7","040",75,"Kool Mu",40,"Toroid",2.2999999999999998,23,0.18,4.57,0.42499999999999999,10.8,0.18099999999999999,4.5999999999999996,9.5699999999999993E-2,9.5699999999999985,0.22,220,0.16400000000000001,40,{"$f":"VLOOKUP(U744,'Powder Core Toroid OD'!$A$2:$B$36,2,FALSE)","v":10.199999999999999}]
[55059,"C055059A2",310,60,"MPP",43,"Toroid",5.67,56.7,0.52500000000000002,13.3,0.93,23.7,0.33,8.39,0.317,31.7,1.8,1800,1.39,310,{"$f":"VLOOKUP(U745,'Powder Core Toroid OD'!$A$2:$B$36,2,FALSE)","v":22.9}]
[58059,"C058059A2",310,60,"High Flux",43,"Toroid",5.67,56.7,0.52500000000000002,13.3,0.93,23.7,0.33,8.39,0.317,31.7,1.8,1800,1.39,310,{"$f":"VLOOKUP(U746,'Powder Core Toroid OD'!$A$2:$B$36,2,FALSE)","v":22.9}]
[77313,"0077313A7",310,14,"Kool Mu",9.9,"Toroid",5.67,56.7,0.52500000000000002,13.3,0.93,23.7,0.33,8.39,0.317,31.7,1.8,1800,1.39,310,{"$f":"VLOOKUP(U747,'Powder Core Toroid OD'!$A$2:$B$36,2,FALSE)","v":22.9}]
[77353,"0077353A7",350,14,"Kool Mu",12,"Toroid",5.88,58.8,0.54200000000000004,13.7,0.95799999999999996,24.4,0.38,9.66,0.38800000000000001,38.800000000000004,2.2814399999999999,2280,1.49,350,{"$f":"VLOOKUP(U748,'Powder Core Toroid OD'!$A$2:$B$36,2,FALSE)","v":23.6}]
[77933,"0077933A7",930,14,"Kool Mu",18,"Toroid",6.35,63.5,0.55500000000000005,14.1,1.0900000000000001,27.69,0.47,12,0.65400000000000003,65.400000000000006,4.1500000000000004,4150,1.56,930,{"$f":"VLOOKUP(U749,'Powder Core Toroid OD'!$A$2:$B$36,2,FALSE)","v":26.9}]
[77551,"0077551A7",548,14,"Kool Mu",14,"Toroid",8.14,81.400000000000006,0.76600000000000001,19.399999999999999,1.325,33.659999999999997,0.45,11.5,0.65600000000000003,65.599999999999994,5.34,5340,2.97,548,{"$f":"VLOOKUP(U750,'Powder Core Toroid OD'!$A$2:$B$36,2,FALSE)","v":32.799999999999997}]
[55584,"C055584A2",585,147,"MPP",93,"Toroid",8.9499999999999993,89.5,0.88800000000000001,22.5,1.385,35.18,0.38500000000000001,9.7799999999999994,0.46400000000000002,46.4,4.1500000000000004,4150,3.99,585,{"$f":"VLOOKUP(U751,'Powder Core Toroid OD'!$A$2:$B$36,2,FALSE)","v":34.299999999999997}]
[58584,"C058584A2",585,147,"High Flux",93,"Toroid",8.9499999999999993,89.5,0.88800000000000001,22.5,1.385,35.18,0.38500000000000001,9.7799999999999994,0.46400000000000002,46.4,4.1500000000000004,4150,3.99,585,{"$f":"VLOOKUP(U752,'Powder Core Toroid OD'!$A$2:$B$36,2,FALSE)","v":34.299999999999997}]
[58587,"0058587A2",585,26,"High Flux",16,"Toroid",8.9499999999999993,89.5,0.88800000000000001,22.5,1.385,35.18,0.38500000000000001,9.7799999999999994,0.46400000000000002,46.4,4.1500000000000004,4150,3.99,585,{"$f":"VLOOKUP(U753,'Powder Core Toroid OD'!$A$2:$B$36,2,FALSE)","v":34.299999999999997}]
[58588,"0058588A2",585,14,"High Flux",9,"Toroid",8.9499999999999993,89.5,0.88800000000000001,22.5,1.385,35.18,0.38500000000000001,9.7799999999999994,0.46400000000000002,46.4,4.1500000000000004,4150,3.99,585,{"$f":"VLOOKUP(U754,'Powder Core Toroid OD'!$A$2:$B$36,2,FALSE)","v":34.299999999999997}]
[77588,"0077588A7",585,14,"Kool Mu",9,"Toroid",8.9499999999999993,89.5,0.88800000000000001,22.5,1.385,35.18,0.38500000000000001,9.7799999999999994,0.46400000000000002,46.4,4.1500000000000004,4150,3.99,585,{"$f":"VLOOKUP(U755,'Powder Core Toroid OD'!$A$2:$B$36,2,FALSE)","v":34.299999999999997}]
[58323,"C058323A2",324,147,"High Flux",138,"Toroid",8.98,89.800000000000011,0.84799999999999998,21.5,1.4450000000000001,36.71,0.44700000000000001,11.4,0.67800000000000005,67.800000000000011,6.09,6090,3.64,324,{"$f":"VLOOKUP(U756,'Powder Core Toroid OD'!$A$2:$B$36,2,FALSE)","v":35.799999999999997}]
[77327,"0077327A7",324,14,"Kool Mu",13,"Toroid",8.98,89.800000000000011,0.84799999999999998,21.5,1.4450000000000001,36.71,0.44700000000000001,11.4,0.67800000000000005,67.800000000000011,6.09,6090,3.64,324,{"$f":"VLOOKUP(U757,'Powder Core Toroid OD'!$A$2:$B$36,2,FALSE)","v":35.799999999999997}]
[77257,"0077257A7",254,14,"Kool Mu",19,"Toroid",9.84,98.4,0.91800000000000004,23.3,1.605,40.770000000000003,0.60499999999999998,15.4,1.07,107,10.6,10600,4.2699999999999996,254,{"$f":"VLOOKUP(U758,'Powder Core Toroid OD'!$A$2:$B$36,2,FALSE)","v":39.9}]
[58437,"C058437A2",438,147,"High FLux",330,"Toroid",10.7,107,0.91800000000000004,23.3,1.875,47.63,0.745,19,1.99,199,21.3,21300,4.2699999999999996,438,{"$f":"VLOOKUP(U759,'Powder Core Toroid OD'!$A$2:$B$36,2,FALSE)","v":46.7}]
[77441,"0077441A7",438,14,"Kool Mu",32,"Toroid",10.7,107,0.91800000000000004,23.3,1.875,47.63,0.745,19,1.99,199,21.3,21300,4.2699999999999996,438,{"$f":"VLOOKUP(U760,'Powder Core Toroid OD'!$A$2:$B$36,2,FALSE)","v":46.7}]
[77092,"0077092A7","089",14,"Kool Mu",20,"Toroid",11.6,116,1.0980000000000001,27.88,1.875,47.63,0.63500000000000001,16.100000000000001,1.34,134,15.6,15600,6.1,89,{"$f":"VLOOKUP(U761,'Powder Core Toroid OD'!$A$2:$B$36,2,FALSE)","v":46.7}]
[55082,"C055082A2","089",173,"MPP",246,"Toroid",11.6,116,1.0980000000000001,27.88,1.875,47.63,0.63500000000000001,16.100000000000001,1.34,134,15.6,15600,6.1,89,{"$f":"VLOOKUP(U762,'Powder Core Toroid OD'!$A$2:$B$36,2,FALSE)","v":46.7}]
[55084,"C055084A2","089",300,"MPP",427,"Toroid",11.6,116,1.0980000000000001,27.88,1.875,47.63,0.63500000000000001,16.100000000000001,1.34,134,15.6,15600,6.1,89,{"$f":"VLOOKUP(U763,'Powder Core Toroid OD'!$A$2:$B$36,2,FALSE)","v":46.7}]
[55086,"C055086A2","089",200,"MPP",285,"Toroid",11.6,116,1.0980000000000001,27.88,1.875,47.63,0.63500000000000001,16.100000000000001,1.34,134,15.6,15600,6.1,89,{"$f":"VLOOKUP(U764,'Powder Core Toroid OD'!$A$2:$B$36,2,FALSE)","v":46.7}]
[55087,"C055087A2","089",160,"MPP",228,"Toroid",11.6,116,1.0980000000000001,27.88,1.875,47.63,0.63500000000000001,16.100000000000001,1.34,134,15.6,15600,6.1,89,{"$f":"VLOOKUP(U765,'Powder Core Toroid OD'!$A$2:$B$36,2,FALSE)","v":46.7}]
[55088,"C055088A2","089",147,"MPP",210,"Toroid",11.6,116,1.0980000000000001,27.88,1.875,47.63,0.63500000000000001,16.100000000000001,1.34,134,15.6,15600,6.1,89,{"$f":"VLOOKUP(U766,'Powder Core Toroid OD'!$A$2:$B$36,2,FALSE)","v":46.7}]
[55089,"C055089A2","089",125,"MPP",178,"Toroid",11.6,116,1.0980000000000001,27.88,1.875,47.63,0.63500000000000001,16.100000000000001,1.34,134,15.6,15600,6.1,89,{"$f":"VLOOKUP(U767,'Powder Core Toroid OD'!$A$2:$B$36,2,FALSE)","v":46.7}]
[55090,"C055090A2","089",60,"MPP",86,"Toroid",11.6,116,1.0980000000000001,27.88,1.875,47.63,0.63500000000000001,16.100000000000001,1.34,134,15.6,15600,6.1,89,{"$f":"VLOOKUP(U768,'Powder Core Toroid OD'!$A$2:$B$36,2,FALSE)","v":46.7}]
[77092,"0077092A7","089",14,"Kool Mu",20,"Toroid",11.6,116,1.0980000000000001,27.88,1.875,47.63,0.63500000000000001,16.100000000000001,1.34,134,15.6,15600,6.1,89,{"$f":"VLOOKUP(U769,'Powder Core Toroid OD'!$A$2:$B$36,2,FALSE)","v":46.7}]
[77718,"0077718A7",715,14,"Kool Mu",17,"Toroid",12.7,127,1.218,30.93,2.0350000000000001,51.69,0.56500000000000006,14.4,1.25,125,15.9,15900,7.51,715,{"$f":"VLOOKUP(U770,'Powder Core Toroid OD'!$A$2:$B$36,2,FALSE)","v":50.8}]
[55709,"C055709A2",715,173,"MPP",210,"Toroid",12.7,127,1.218,30.93,2.0350000000000001,51.69,0.56500000000000006,14.4,1.25,125,15.9,15900,7.51,715,{"$f":"VLOOKUP(U771,'Powder Core Toroid OD'!$A$2:$B$36,2,FALSE)","v":50.8}]
[55712,"C055712A2",715,200,"MPP",243,"Toroid",12.7,127,1.218,30.93,2.0350000000000001,51.69,0.56500000000000006,14.4,1.25,125,15.9,15900,7.51,715,{"$f":"VLOOKUP(U772,'Powder Core Toroid OD'!$A$2:$B$36,2,FALSE)","v":50.8}]
[55196,"C055196A2",195,147,"MPP",306,"Toroid",12.5,125,1.0069999999999999,25.57,2.2850000000000001,58.04,0.63500000000000001,16.2,2.29,229,28.6,28600,5.14,195,{"$f":"VLOOKUP(U773,'Powder Core Toroid OD'!$A$2:$B$36,2,FALSE)","v":57.2}]
[55197,"C055197A2",195,160,"MPP",333,"Toroid",12.5,125,1.0069999999999999,25.57,2.2850000000000001,58.04,0.63500000000000001,16.2,2.29,229,28.6,28600,5.14,195,{"$f":"VLOOKUP(U774,'Powder Core Toroid OD'!$A$2:$B$36,2,FALSE)","v":57.2}]
[55198,"C055198A2",195,173,"MPP",360,"Toroid",12.5,125,1.0069999999999999,25.57,2.2850000000000001,58.04,0.63500000000000001,16.2,2.29,229,28.6,28600,5.14,195,{"$f":"VLOOKUP(U775,'Powder Core Toroid OD'!$A$2:$B$36,2,FALSE)","v":57.2}]
[55199,"C055199A2",195,200,"MPP",417,"Toroid",12.5,125,1.0069999999999999,25.57,2.2850000000000001,58.04,0.63500000000000001,16.2,2.29,229,28.6,28600,5.14,195,{"$f":"VLOOKUP(U776,'Powder Core Toroid OD'!$A$2:$B$36,2,FALSE)","v":57.2}]
[77190,"0077190A7",195,14,"Kool Mu",32,"Toroid",12.5,125,1.0069999999999999,25.57,2.2850000000000001,58.04,0.63500000000000001,16.2,2.29,229,28.6,28600,5.14,195,{"$f":"VLOOKUP(U777,'Powder Core Toroid OD'!$A$2:$B$36,2,FALSE)","v":57.2}]
[77112,"0077112A7",109,14,"Kool Mu",18,"Toroid",14.3,143,1.3680000000000001,34.74,2.2850000000000001,58.04,0.58499999999999996,14.9,1.44,144,20.7,20700,9.48,109,{"$f":"VLOOKUP(U778,'Powder Core Toroid OD'!$A$2:$B$36,2,FALSE)","v":57.2}]
[77614,"0077614A7",620,14,"Kool Mu",44,"Toroid",14.4,144,1.248,31.69,2.4769999999999999,62.91,1.02,25.91,3.6,360,51.8,51800,7.89,620,{"$f":"VLOOKUP(U779,'Powder Core Toroid OD'!$A$2:$B$36,2,FALSE)","v":62}]
[77734,"0077734A7",740,14,"Kool Mu",48,"Toroid",18.399999999999999,184,1.748,44.39,2.9529999999999998,75.010000000000005,1.4139999999999999,35.92,4.97,497,91.4,91400,15.5,740,{"$f":"VLOOKUP(U780,'Powder Core Toroid OD'!$A$2:$B$36,2,FALSE)","v":74.099999999999994}]
[77869,"0077869A7",866,14,"Kool Mu",16,"Toroid",19.600000000000001,196,1.8979999999999999,48.2,3.1080000000000001,78.95,0.54500000000000004,13.9,1.76,176,34.5,34500,18.2,866,{"$f":"VLOOKUP(U781,'Powder Core Toroid OD'!$A$2:$B$36,2,FALSE)","v":77.8}]
[77907,"0077909A7",906,14,"Kool Mu",20,"Toroid",19.600000000000001,196,1.8979999999999999,48.2,3.1080000000000001,78.95,0.67,17.100000000000001,2.21,221,43.4,43400,18.2,906,{"$f":"VLOOKUP(U782,'Powder Core Toroid OD'!$A$2:$B$36,2,FALSE)","v":77.8}]
[77866,"0077866A7",866,125,"Kool Mu",142,"Toroid",19.600000000000001,196,1.8979999999999999,48.2,3.1080000000000001,78.95,0.54500000000000004,13.9,1.76,176,34.5,34500,18.2,866,{"$f":"VLOOKUP(U783,'Powder Core Toroid OD'!$A$2:$B$36,2,FALSE)","v":77.8}]
[77101,"0077101A7",102,14,"Kool Mu",26,"Toroid",24.3,243,2.1949999999999998,55.75,4.0549999999999997,103,0.70499999999999996,17.899999999999999,3.58,358,86.9,86900,24.7,102,{"$f":"VLOOKUP(U784,'Powder Core Toroid OD'!$A$2:$B$36,2,FALSE)","v":101.6}]
[77338,"0077338A7",337,40,"Kool Mu",105,"Toroid",32.4,324,3.0390000000000001,77.19,5.274,134,1.0549999999999999,26.8,6.78,678,220,220000,47.1,{"$f":"C785*1","v":337},{"$f":"VLOOKUP(U785,'Powder Core Toroid OD'!$A$2:$B$36,2,FALSE)","v":132.6}]
[77339,"0077339A7",337,60,"Kool Mu",158,"Toroid",32.4,324,3.0390000000000001,77.19,5.274,134,1.0549999999999999,26.8,6.78,678,220,220000,47.1,337,{"$f":"VLOOKUP(U786,'Powder Core Toroid OD'!$A$2:$B$36,2,FALSE)","v":132.6}]
[77336,"0077336A7",337,14,"Kool Mu",37,"Toroid",32.4,324,3.0390000000000001,77.19,5.274,134,1.0549999999999999,26.8,6.78,678,220,220000,47.1,337,{"$f":"VLOOKUP(U787,'Powder Core Toroid OD'!$A$2:$B$36,2,FALSE)","v":132.6}]
[78337,"0078337A7",337,26,"XFlux",68,"Toroid",32.4,324,3.0390000000000001,77.19,5.274,134,1.0549999999999999,26.8,6.78,678,220,220000,47.1,337,{"$f":"VLOOKUP(U788,'Powder Core Toroid OD'!$A$2:$B$36,2,FALSE)","v":132.6}]
[77164,"0077164A7",165,14,"Kool Mu",42,"Toroid",41.2,412,3.9769999999999999,101,6.5549999999999997,166.5,1.3049999999999999,33.15,9.8699999999999992,987,407,407000,80.3,165,{"$f":"VLOOKUP(U789,'Powder Core Toroid OD'!$A$2:$B$36,2,FALSE)","v":165.1}]
[78167,"0078167A7",165,60,"XFlux",180,"Toroid",41.2,412,3.9769999999999999,101,6.5549999999999997,166.5,1.3049999999999999,33.15,9.8699999999999992,987,407,407000,80.3,165,{"$f":"VLOOKUP(U790,'Powder Core Toroid OD'!$A$2:$B$36,2,FALSE)","v":165.1}]
[78165,"0078165A7",165,26,"XFlux",78,"Toroid",41.2,412,3.9769999999999999,101,6.5549999999999997,166.5,1.3049999999999999,33.15,9.8699999999999992,987,407,407000,80.3,165,{"$f":"VLOOKUP(U791,'Powder Core Toroid OD'!$A$2:$B$36,2,FALSE)","v":165.1}]
[78099,"0078099A7",102,60,"XFlux",111,"Toroid",24.3,243,2.1949999999999998,55.75,4.0549999999999997,103,0.70499999999999996,17.899999999999999,3.58,358,86.9,86900,24.7,102,{"$f":"VLOOKUP(U792,'Powder Core Toroid OD'!$A$2:$B$36,2,FALSE)","v":101.6}]
[78102,"0078102A7",102,26,"XFlux",48,"Toroid",24.3,243,2.1949999999999998,55.75,4.0549999999999997,103,0.70499999999999996,17.899999999999999,3.58,358,86.9,86900,24.7,{"$f":"C793*1","v":102},{"$f":"VLOOKUP(U793,'Powder Core Toroid OD'!$A$2:$B$36,2,FALSE)","v":101.6}]
[78339,"0078339A7",337,60,"XFlux",158,"Toroid",32.4,324,3.0390000000000001,77.19,5.274,134,1.0549999999999999,26.8,6.78,678,220,220000,47.1,337,{"$f":"VLOOKUP(U794,'Powder Core Toroid OD'!$A$2:$B$36,2,FALSE)","v":132.6}]
[77070,"0077070A7","070",125,"Kool Mu",298,"Toroid",15.8,158,1.3660000000000001,34.700000000000003,2.7320000000000002,69.400000000000006,0.84299999999999997,21.4,3.14,314,49.7,49700,9.4499999999999993,70,{"$f":"VLOOKUP(U795,'Powder Core Toroid OD'!$A$2:$B$38,2,FALSE)","v":68}]
[77072,"0077072A7","070",60,"Kool Mu",143,"Toroid",15.8,158,1.3660000000000001,34.700000000000003,2.7320000000000002,69.400000000000006,0.84299999999999997,21.4,3.14,314,49.7,49700,9.4499999999999993,70,{"$f":"VLOOKUP(U796,'Powder Core Toroid OD'!$A$2:$B$38,2,FALSE)","v":68}]
[77073,"0077073A7","070",40,"Kool Mu",95,"Toroid",15.8,158,1.3660000000000001,34.700000000000003,2.7320000000000002,69.400000000000006,0.84299999999999997,21.4,3.14,314,49.7,49700,9.4499999999999993,70,{"$f":"VLOOKUP(U797,'Powder Core Toroid OD'!$A$2:$B$38,2,FALSE)","v":68}]
[77074,"0077074A7","070",26,"Kool Mu",62,"Toroid",15.8,158,1.3660000000000001,34.700000000000003,2.7320000000000002,69.400000000000006,0.84299999999999997,21.4,3.14,314,49.7,49700,9.4499999999999993,70,{"$f":"VLOOKUP(U798,'Powder Core Toroid OD'!$A$2:$B$38,2,FALSE)","v":68}]
[77075,"0077075A7","070",14,"Kool Mu",33,"Toroid",15.8,158,1.3660000000000001,34.700000000000003,2.7320000000000002,69.400000000000006,0.84299999999999997,21.4,3.14,314,49.7,49700,9.4499999999999993,70,{"$f":"VLOOKUP(U799,'Powder Core Toroid OD'!$A$2:$B$38,2,FALSE)","v":68}]
[78072,"0078072A7","070",60,"XFlux",143,"Toroid",15.8,158,1.3660000000000001,34.700000000000003,2.7320000000000002,69.400000000000006,0.84299999999999997,21.4,3.14,314,49.7,49700,9.4499999999999993,70,{"$f":"VLOOKUP(U800,'Powder Core Toroid OD'!$A$2:$B$38,2,FALSE)","v":68}]
[78052,"0078052A7","050",26,"XFlux",12,"Toroid",3.12,31.2,0.27500000000000002,6.98,0.53,13.5,0.217,5.52,0.109,10.9,0.34,340,0.38300000000000001,50,{"$f":"VLOOKUP(U801,'Powder Core Toroid OD'!$A$2:$B$36,2,FALSE)","v":12.7}]
[78122,"0078112A7",120,26,"XFlux",15,"Toroid",4.12,41.2,0.375,9.52,0.68,17.3,0.28000000000000003,7.12,0.192,19.2,0.79100000000000004,791,0.71199999999999997,120,{"$f":"VLOOKUP(U802,'Powder Core Toroid OD'!$A$2:$B$36,2,FALSE)","v":16.600000000000001}]
[78382,"0078328A7","380",26,"XFlux",19,"Toroid",4.1399999999999997,41.4,0.35499999999999998,9.01,0.71,18.100000000000001,0.28000000000000003,7.12,0.23200000000000001,23.200000000000003,0.96,960,0.63800000000000001,380,{"$f":"VLOOKUP(U803,'Powder Core Toroid OD'!$A$2:$B$36,2,FALSE)","v":17.3}]
[78208,"0078208A7",206,26,"XFlux",14,"Toroid",5.09,50.9,0.47500000000000003,12,0.83,21.1,0.28000000000000003,7.12,0.221,22.1,1.1200000000000001,1120,1.1399999999999999,206,{"$f":"VLOOKUP(U804,'Powder Core Toroid OD'!$A$2:$B$36,2,FALSE)","v":20.3}]
[78312,"0078312A7",310,26,"XFlux",19,"Toroid",5.67,56.7,0.52500000000000002,13.3,0.93,23.7,0.33,8.39,0.317,31.7,1.8,1800,1.39,310,{"$f":"VLOOKUP(U805,'Powder Core Toroid OD'!$A$2:$B$36,2,FALSE)","v":22.9}]
[78352,"0078352A7","350",26,"XFlux",22,"Toroid",5.88,58.8,0.54200000000000004,13.7,0.95799999999999996,24.4,0.38,9.66,0.38800000000000001,38.800000000000004,2.2814399999999999,2280,1.49,350,{"$f":"VLOOKUP(U806,'Powder Core Toroid OD'!$A$2:$B$36,2,FALSE)","v":23.6}]
[78932,"0078932A7",930,26,"XFlux",32,"Toroid",6.35,63.5,0.55500000000000005,14.1,1.0900000000000001,27.69,0.47,12,0.65400000000000003,65.400000000000006,4.1500000000000004,4150,1.56,930,{"$f":"VLOOKUP(U807,'Powder Core Toroid OD'!$A$2:$B$36,2,FALSE)","v":26.9}]
[78550,"0078550A7",548,26,"XFlux",28,"Toroid",8.14,81.400000000000006,0.76600000000000001,19.399999999999999,1.325,33.659999999999997,0.45,11.5,0.65600000000000003,65.599999999999994,5.34,5340,2.97,548,{"$f":"VLOOKUP(U808,'Powder Core Toroid OD'!$A$2:$B$36,2,FALSE)","v":32.799999999999997}]
[78587,"0078587A7",585,26,"XFlux",16,"Toroid",8.9499999999999993,89.5,0.88800000000000001,22.5,1.385,35.18,0.38500000000000001,9.7799999999999994,0.46400000000000002,46.4,4.1500000000000004,4150,3.99,585,{"$f":"VLOOKUP(U809,'Powder Core Toroid OD'!$A$2:$B$36,2,FALSE)","v":34.299999999999997}]
[78326,"0078326A7",324,26,"XFlux",24,"Toroid",8.98,89.800000000000011,0.84799999999999998,21.5,1.4450000000000001,36.71,0.44700000000000001,11.4,0.67800000000000005,67.800000000000011,6.09,6090,3.64,324,{"$f":"VLOOKUP(U810,'Powder Core Toroid OD'!$A$2:$B$36,2,FALSE)","v":35.799999999999997}]
[78256,"0078256A7",254,26,"XFlux",35,"Toroid",9.84,98.4,0.91800000000000004,23.3,1.605,40.770000000000003,0.60499999999999998,15.4,1.07,107,10.6,10600,4.2699999999999996,254,{"$f":"VLOOKUP(U811,'Powder Core Toroid OD'!$A$2:$B$36,2,FALSE)","v":39.9}]
[78440,"0078440A7","438",26,"XFlux",59,"Toroid",10.7,107,0.91800000000000004,23.3,1.875,47.63,0.745,19,1.99,199,21.3,21300,4.2699999999999996,438,{"$f":"VLOOKUP(U812,'Powder Core Toroid OD'!$A$2:$B$36,2,FALSE)","v":46.7}]
[78091,"0078091A7","089",26,"XFlux",37,"Toroid",11.6,116,1.0980000000000001,27.88,1.875,47.63,0.63500000000000001,16.100000000000001,1.34,134,15.6,15600,6.1,89,{"$f":"VLOOKUP(U813,'Powder Core Toroid OD'!$A$2:$B$36,2,FALSE)","v":46.7}]
[78717,"0078717A7","715",26,"XFlux",32,"Toroid",12.7,127,1.218,30.93,2.0350000000000001,51.69,0.56500000000000006,14.4,1.25,125,15.9,15900,7.51,715,{"$f":"VLOOKUP(U814,'Powder Core Toroid OD'!$A$2:$B$36,2,FALSE)","v":50.8}]
[78191,"0078191A7","195",26,"XFlux",60,"Toroid",12.5,125,1.0069999999999999,25.57,2.2850000000000001,58.04,0.63500000000000001,16.2,2.29,229,28.6,28600,5.14,195,{"$f":"VLOOKUP(U815,'Powder Core Toroid OD'!$A$2:$B$36,2,FALSE)","v":57.2}]
[78111,"0078111A7","109",26,"XFlux",33,"Toroid",14.3,143,1.3680000000000001,34.74,2.2850000000000001,58.04,0.58499999999999996,14.9,1.44,144,20.7,20700,9.48,109,{"$f":"VLOOKUP(U816,'Powder Core Toroid OD'!$A$2:$B$36,2,FALSE)","v":57.2}]
[78615,"0078615A7",620,26,"XFlux",82,"Toroid",14.4,144,1.248,31.69,2.4769999999999999,62.91,1.02,25.91,3.6,360,51.8,51800,7.89,620,{"$f":"VLOOKUP(U817,'Powder Core Toroid OD'!$A$2:$B$36,2,FALSE)","v":62}]
[78735,"0078735A7","740",26,"XFlux",88,"Toroid",18.399999999999999,184,1.748,44.39,2.9529999999999998,75.010000000000005,1.4139999999999999,35.92,4.97,497,91.4,91400,15.5,740,{"$f":"VLOOKUP(U818,'Powder Core Toroid OD'!$A$2:$B$36,2,FALSE)","v":74.099999999999994}]
[75099,"0075099A7",102,60,"MIX",111,"Toroid",24.3,243,2.1949999999999998,55.75,4.0549999999999997,103,0.70499999999999996,17.899999999999999,3.58,358,86.9,86900,24.7,102,101.6]
[75100,"0075100A7",102,40,"MIX",74,"Toroid",24.3,243,2.1949999999999998,55.75,4.0549999999999997,103,0.70499999999999996,17.899999999999999,3.58,358,86.9,86900,24.7,102,101.6]
[75102,"0075102A7",102,26,"MIX",48,"Toroid",24.3,243,2.1949999999999998,55.75,4.0549999999999997,103,0.70499999999999996,17.899999999999999,3.58,358,86.9,86900,24.7,102,101.6]
[75165,"0075165A7",165,26,"MIX",78,"Toroid",41.2,412,3.9769999999999999,101,6.5549999999999997,166.5,1.3049999999999999,33.15,9.8699999999999992,987,407,407000,80.3,165,165.1]
[75337,"0075337A7",337,26,"MIX",68,"Toroid",32.4,324,3.0390000000000001,77.19,5.274,134,1.0549999999999999,26.8,6.78,678,220,220000,47.1,337,132.6]
[75615,"0075615A7",620,26,"MIX",82,"Toroid",14.4,144,1.248,31.69,2.4769999999999999,62.91,1.02,25.91,3.6,360,51.8,51800,7.89,620,62]
[75616,"0075616A7",620,40,"MIX",126,"Toroid",14.4,144,1.248,31.69,2.4769999999999999,62.91,1.02,25.91,3.6,360,51.8,51800,7.89,620,62]
[75617,"0075617A7",620,60,"MIX",189,"Toroid",14.4,144,1.248,31.69,2.4769999999999999,62.91,1.02,25.91,3.6,360,51.8,51800,7.89,620,62]
[75735,"0075735A7",740,26,"MIX",88,"Toroid",18.399999999999999,184,1.748,44.39,2.9529999999999998,75.010000000000005,1.4139999999999999,35.92,4.97,497,91.4,91400,15.5,740,74.099999999999994]
[75736,"0075736A7",740,40,"MIX",136,"Toroid",18.399999999999999,184,1.748,44.39,2.9529999999999998,75.010000000000005,1.4139999999999999,35.92,4.97,497,91.4,91400,15.5,740,74.099999999999994]
[75737,"0075737A7",740,60,"MIX",204,"Toroid",18.399999999999999,184,1.748,44.39,2.9529999999999998,75.010000000000005,1.4139999999999999,35.92,4.97,497,91.4,91400,15.5,740,74.099999999999994]
[75059,"0075059A7",310,60,"MIX",43,"Toroid",5.67,56.7,0.52500000000000002,13.3,0.93,23.7,0.33,8.39,0.317,31.7,1.8,1800,1.39,310,22.9]
[75071,"0075071A7",548,60,"MIX",61,"Toroid",8.14,81.400000000000006,0.76600000000000001,19.399999999999999,1.325,33.659999999999997,0.45,11.5,0.65600000000000003,65.599999999999994,5.34,5340,2.97,548,32.799999999999997]
[75076,"0075076A7",324,60,"MIX",56,"Toroid",8.98,89.800000000000011,0.84799999999999998,21.5,1.4450000000000001,36.71,0.44700000000000001,11.4,0.67800000000000005,67.800000000000011,6.09,6090,3.64,324,35.799999999999997]
[75083,"0075083A7",254,60,"MIX",81,"Toroid",9.84,98.4,0.91800000000000004,23.3,1.605,40.770000000000003,0.60499999999999998,15.4,1.07,107,10.6,10600,4.2699999999999996,254,39.9]
[75090,"0075090A7","089",60,"MIX",86,"Toroid",11.6,116,1.0980000000000001,27.88,1.875,47.63,0.63500000000000001,16.100000000000001,1.34,134,15.6,15600,6.1,89,46.7]
[75091,"0075091A7","089",26,"MIX",37,"Toroid",11.6,116,1.0980000000000001,27.88,1.875,47.63,0.63500000000000001,16.100000000000001,1.34,134,15.6,15600,6.1,89,46.7]
[75095,"0075095A7","089",40,"MIX",57,"Toroid",11.6,116,1.0980000000000001,27.88,1.875,47.63,0.63500000000000001,16.100000000000001,1.34,134,15.6,15600,6.1,89,46.7]
[75110,"0075110A7",109,60,"MIX",75,"Toroid",14.3,143,1.3680000000000001,34.74,2.2850000000000001,58.04,0.58499999999999996,14.9,1.44,144,20.7,20700,9.48,109,57.2]
[75111,"0075111A7",109,26,"MIX",33,"Toroid",14.3,143,1.3680000000000001,34.74,2.2850000000000001,58.04,0.58499999999999996,14.9,1.44,144,20.7,20700,9.48,109,57.2]
[75189,"0075189A7",195,40,"MIX",92,"Toroid",12.5,125,1.0069999999999999,25.57,2.2850000000000001,58.04,0.63500000000000001,16.2,2.29,229,28.6,28600,5.14,195,57.2]
[75191,"0075191A7",195,26,"MIX",60,"Toroid",12.5,125,1.0069999999999999,25.57,2.2850000000000001,58.04,0.63500000000000001,16.2,2.29,229,28.6,28600,5.14,195,57.2]
[75192,"0075192A7",195,60,"MIX",138,"Toroid",12.5,125,1.0069999999999999,25.57,2.2850000000000001,58.04,0.63500000000000001,16.2,2.29,229,28.6,28600,5.14,195,57.2]
[75212,"0075212A7",109,40,"MIX",50,"Toroid",14.3,143,1.3680000000000001,34.74,2.2850000000000001,58.04,0.58499999999999996,14.9,1.44,144,20.7,20700,9.48,109,57.2]
[75256,"0075256A7",254,26,"MIX",35,"Toroid",9.84,98.4,0.91800000000000004,23.3,1.605,40.770000000000003,0.60499999999999998,15.4,1.07,107,10.6,10600,4.2699999999999996,254,39.9]
[75260,"0075260A7",254,40,"MIX",54,"Toroid",9.84,98.4,0.91800000000000004,23.3,1.605,40.770000000000003,0.60499999999999998,15.4,1.07,107,10.6,10600,4.2699999999999996,254,39.9]
[75312,"0075312A7",310,26,"MIX",19,"Toroid",5.67,56.7,0.52500000000000002,13.3,0.93,23.7,0.33,8.39,0.317,31.7,1.8,1800,1.39,310,22.9]
[75316,"0075316A7",310,40,"MIX",29,"Toroid",5.67,56.7,0.52500000000000002,13.3,0.93,23.7,0.33,8.39,0.317,31.7,1.8,1800,1.39,310,22.9]
[75326,"0075326A7",324,26,"MIX",24,"Toroid",8.98,89.800000000000011,0.84799999999999998,21.5,1.4450000000000001,36.71,0.44700000000000001,11.4,0.67800000000000005,67.800000000000011,6.09,6090,3.64,324,35.799999999999997]
[75330,"0075330A7",324,40,"MIX",37,"Toroid",8.98,89.800000000000011,0.84799999999999998,21.5,1.4450000000000001,36.71,0.44700000000000001,11.4,0.67800000000000005,67.800000000000011,6.09,6090,3.64,324,35.799999999999997]
[75351,"0075351A7",350,60,"MIX",51,"Toroid",5.88,58.8,0.54200000000000004,13.7,0.95799999999999996,24.4,0.38,9.66,0.38800000000000001,38.800000000000004,2.2814399999999999,2280,1.49,350,23.6]
[75352,"0075352A7",350,26,"MIX",22,"Toroid",5.88,58.8,0.54200000000000004,13.7,0.95799999999999996,24.4,0.38,9.66,0.38800000000000001,38.800000000000004,2.2814399999999999,2280,1.49,350,23.6]
[75356,"0075356A7",350,40,"MIX",34,"Toroid",5.88,58.8,0.54200000000000004,13.7,0.95799999999999996,24.4,0.38,9.66,0.38800000000000001,38.800000000000004,2.2814399999999999,2280,1.49,350,23.6]
[75431,"0075431A7",438,40,"MIX",90,"Toroid",10.7,107,0.91800000000000004,23.3,1.875,47.63,0.745,19,1.99,199,21.3,21300,4.2699999999999996,438,46.7]
[75439,"0075439A7",438,60,"MIX",135,"Toroid",10.7,107,0.91800000000000004,23.3,1.875,47.63,0.745,19,1.99,199,21.3,21300,4.2699999999999996,438,46.7]
[75440,"0075440A7",438,26,"MIX",59,"Toroid",10.7,107,0.91800000000000004,23.3,1.875,47.63,0.745,19,1.99,199,21.3,21300,4.2699999999999996,438,46.7]
[75550,"0075550A7",548,26,"MIX",28,"Toroid",8.14,81.400000000000006,0.76600000000000001,19.399999999999999,1.325,33.659999999999997,0.45,11.5,0.65600000000000003,65.599999999999994,5.34,5340,2.97,548,32.799999999999997]
[75555,"0075555A7",548,40,"MIX",41,"Toroid",8.14,81.400000000000006,0.76600000000000001,19.399999999999999,1.325,33.659999999999997,0.45,11.5,0.65600000000000003,65.599999999999994,5.34,5340,2.97,548,32.799999999999997]
[75586,"0075586A7",585,60,"MIX",38,"Toroid",8.9499999999999993,89.5,0.88800000000000001,22.5,1.385,35.18,0.38500000000000001,9.7799999999999994,0.46400000000000002,46.4,4.1500000000000004,4150,3.99,585,34.299999999999997]
[75587,"0075587A7",585,26,"MIX",16,"Toroid",8.9499999999999993,89.5,0.88800000000000001,22.5,1.385,35.18,0.38500000000000001,9.7799999999999994,0.46400000000000002,46.4,4.1500000000000004,4150,3.99,585,34.299999999999997]
[75591,"0075591A7",585,40,"MIX",25,"Toroid",8.9499999999999993,89.5,0.88800000000000001,22.5,1.385,35.18,0.38500000000000001,9.7799999999999994,0.46400000000000002,46.4,4.1500000000000004,4150,3.99,585,34.299999999999997]
[75716,"0075716A7",715,60,"MIX",73,"Toroid",12.7,127,1.218,30.93,2.0350000000000001,51.69,0.56500000000000006,14.4,1.25,125,15.9,15900,7.51,715,50.8]
[75717,"0075717A7",715,26,"MIX",32,"Toroid",12.7,127,1.218,30.93,2.0350000000000001,51.69,0.56500000000000006,14.4,1.25,125,15.9,15900,7.51,715,50.8]
[75721,"0075721A7",715,40,"MIX",49,"Toroid",12.7,127,1.218,30.93,2.0350000000000001,51.69,0.56500000000000006,14.4,1.25,125,15.9,15900,7.51,715,50.8]
[75867,"0075867A7",866,60,"MIX",68,"Toroid",19.600000000000001,196,1.8979999999999999,48.2,3.1080000000000001,78.95,0.54500000000000004,13.9,1.76,176,34.5,34500,18.2,866,77.8]
[75868,"0075868A7",866,26,"MIX",30,"Toroid",19.600000000000001,196,1.8979999999999999,48.2,3.1080000000000001,78.95,0.54500000000000004,13.9,1.76,176,34.5,34500,18.2,866,77.8]
[75872,"0075872A7",866,40,"MIX",45,"Toroid",19.600000000000001,196,1.8979999999999999,48.2,3.1080000000000001,78.95,0.54500000000000004,13.9,1.76,176,34.5,34500,18.2,866,77.8]
[75894,"0075894A7",930,60,"MIX",75,"Toroid",6.35,63.5,0.55500000000000005,14.1,1.0900000000000001,27.69,0.47,12,0.65400000000000003,65.400000000000006,4.1500000000000004,4150,1.56,930,26.9]
[75907,"0075907A7",906,60,"MIX",85,"Toroid",19.600000000000001,196,1.8979999999999999,48.2,3.1080000000000001,78.95,0.67,17.100000000000001,2.21,221,43.4,43400,18.2,906,77.8]
[75908,"0075908A7",906,26,"MIX",37,"Toroid",19.600000000000001,196,1.8979999999999999,48.2,3.1080000000000001,78.95,0.67,17.100000000000001,2.21,221,43.4,43400,18.2,906,77.8]
[75912,"0075912A7",906,40,"MIX",57,"Toroid",19.600000000000001,196,1.8979999999999999,48.2,3.1080000000000001,78.95,0.67,17.100000000000001,2.21,221,43.4,43400,18.2,906,77.8]
[75932,"0075932A7",930,26,"MIX",32,"Toroid",6.35,63.5,0.55500000000000005,14.1,1.0900000000000001,27.69,0.47,12,0.65400000000000003,65.400000000000006,4.1500000000000004,4150,1.56,930,26.9]
[75936,"0075936A7",930,40,"MIX",50,"Toroid",6.35,63.5,0.55500000000000005,14.1,1.0900000000000001,27.69,0.47,12,0.65400000000000003,65.400000000000006,4.1500000000000004,4150,1.56,930,26.9]
[75166,"0075166A7",165,40,"MIX",120,"Toroid",41.2,412,3.9769999999999999,101,6.5549999999999997,166.5,1.3049999999999999,33.15,9.8699999999999992,987,407,407000,80.3,165,165.1]
[75338,"0075338A7",337,40,"MIX",105,"Toroid",32.4,324,3.0390000000000001,77.19,5.274,134,1.0549999999999999,26.8,6.78,678,220,220000,47.1,337,132.6]
[75339,"0075339A7",337,60,"MIX",158,"Toroid",32.4,324,3.0390000000000001,77.19,5.274,134,1.0549999999999999,26.8,6.78,678,220,220000,47.1,337,132.6]
[75072,"0075072A7","070",60,"MIX",143,"Toroid",15.8,158,1.3660000000000001,34.700000000000003,2.7320000000000002,69.400000000000006,0.84299999999999997,21.4,3.14,314,49.7,49700,9.4499999999999993,70,{"$f":"VLOOKUP(U875,'Powder Core Toroid OD'!$A$2:$B$38,2,FALSE)","v":68}]
[75073,"0075073A7","070",40,"MIX",95,"Toroid",15.8,158,1.3660000000000001,34.700000000000003,2.7320000000000002,69.400000000000006,0.84299999999999997,21.4,3.14,314,49.7,49700,9.4499999999999993,70,{"$f":"VLOOKUP(U876,'Powder Core Toroid OD'!$A$2:$B$38,2,FALSE)","v":68}]
[75074,"0075074A7","070",26,"MIX",62,"Toroid",15.8,158,1.3660000000000001,34.700000000000003,2.7320000000000002,69.400000000000006,0.84299999999999997,21.4,3.14,314,49.7,49700,9.4499999999999993,70,{"$f":"VLOOKUP(U877,'Powder Core Toroid OD'!$A$2:$B$38,2,FALSE)","v":68}]
[79057,"0079057A7","050",19,"KMM",8.8000000000000007,"Toroid",3.12,31.2,0.27500000000000002,6.98,0.53,13.5,0.217,5.52,0.109,10.9,0.34,340,0.38300000000000001,{"$f":"C878*1","v":50},{"$f":"VLOOKUP(U878,'Powder Core Toroid OD'!$A$2:$B$36,2,FALSE)","v":12.7}]
[79052,"0079052A7","050",26,"KMM",12,"Toroid",3.12,31.2,0.27500000000000002,6.98,0.53,13.5,0.217,5.52,0.109,10.9,0.34,340,0.38300000000000001,{"$f":"C879*1","v":50},{"$f":"VLOOKUP(U879,'Powder Core Toroid OD'!$A$2:$B$36,2,FALSE)","v":12.7}]
[79056,"0079056A7","050",40,"KMM",18,"Toroid",3.12,31.2,0.27500000000000002,6.98,0.53,13.5,0.217,5.52,0.109,10.9,0.34,340,0.38300000000000001,{"$f":"C880*1","v":50},{"$f":"VLOOKUP(U880,'Powder Core Toroid OD'!$A$2:$B$36,2,FALSE)","v":12.7}]
[79051,"0079051A7","050",60,"KMM",27,"Toroid",3.12,31.2,0.27500000000000002,6.98,0.53,13.5,0.217,5.52,0.109,10.9,0.34,340,0.38300000000000001,{"$f":"C881*1","v":50},{"$f":"VLOOKUP(U881,'Powder Core Toroid OD'!$A$2:$B$36,2,FALSE)","v":12.7}]
[79226,"0079226A7","120",19,"KMM",11,"Toroid",4.12,41.2,0.375,9.52,0.68,17.3,0.28000000000000003,7.12,0.192,19.2,0.79100000000000004,791,0.71199999999999997,{"$f":"C882*1","v":120},{"$f":"VLOOKUP(U882,'Powder Core Toroid OD'!$A$2:$B$36,2,FALSE)","v":16.600000000000001}]
[79122,"0079122A7",120,26,"KMM",15,"Toroid",4.12,41.2,0.375,9.52,0.68,17.3,0.28000000000000003,7.12,0.192,19.2,0.79100000000000004,791,0.71199999999999997,120,{"$f":"VLOOKUP(U883,'Powder Core Toroid OD'!$A$2:$B$36,2,FALSE)","v":16.600000000000001}]
[79113,"0079113A7",120,40,"KMM",24,"Toroid",4.12,41.2,0.375,9.52,0.68,17.3,0.28000000000000003,7.12,0.192,19.2,0.79100000000000004,791,0.71199999999999997,{"$f":"C884*1","v":120},{"$f":"VLOOKUP(U884,'Powder Core Toroid OD'!$A$2:$B$36,2,FALSE)","v":16.600000000000001}]
[79121,"0079121A7",120,60,"KMM",35,"Toroid",4.12,41.2,0.375,9.52,0.68,17.3,0.28000000000000003,7.12,0.192,19.2,0.79100000000000004,791,0.71199999999999997,120,{"$f":"VLOOKUP(U885,'Powder Core Toroid OD'!$A$2:$B$36,2,FALSE)","v":16.600000000000001}]
[79387,"0079387A7",380,19,"KMM",14,"Toroid",4.1399999999999997,41.4,0.35499999999999998,9.01,0.71,18.100000000000001,0.28000000000000003,7.12,0.23200000000000001,23.200000000000003,0.96,960,0.63800000000000001,380,{"$f":"VLOOKUP(U886,'Powder Core Toroid OD'!$A$2:$B$36,2,FALSE)","v":17.3}]
[79382,"0079382A7",380,26,"KMM",19,"Toroid",4.1399999999999997,41.4,0.35499999999999998,9.01,0.71,18.100000000000001,0.28000000000000003,7.12,0.23200000000000001,23.200000000000003,0.96,960,0.63800000000000001,380,{"$f":"VLOOKUP(U887,'Powder Core Toroid OD'!$A$2:$B$36,2,FALSE)","v":17.3}]
[79386,"0079386A7",380,40,"KMM",28,"Toroid",4.1399999999999997,41.4,0.35499999999999998,9.01,0.71,18.100000000000001,0.28000000000000003,7.12,0.23200000000000001,23.200000000000003,0.96,960,0.63800000000000001,380,{"$f":"VLOOKUP(U888,'Powder Core Toroid OD'!$A$2:$B$36,2,FALSE)","v":17.3}]
[79381,"0079381A7",380,60,"KMM",43,"Toroid",4.1399999999999997,41.4,0.35499999999999998,9.01,0.71,18.100000000000001,0.28000000000000003,7.12,0.23200000000000001,23.200000000000003,0.96,960,0.63800000000000001,{"$f":"C889*1","v":380},{"$f":"VLOOKUP(U889,'Powder Core Toroid OD'!$A$2:$B$36,2,FALSE)","v":17.3}]
[79849,"0079849A7",206,19,"KMM",10,"Toroid",5.09,50.9,0.47500000000000003,12,0.83,21.1,0.28000000000000003,7.12,0.221,22.1,1.1200000000000001,1120,1.1399999999999999,206,{"$f":"VLOOKUP(U890,'Powder Core Toroid OD'!$A$2:$B$36,2,FALSE)","v":20.3}]
[79208,"0079208A7",206,26,"KMM",14,"Toroid",5.09,50.9,0.47500000000000003,12,0.83,21.1,0.28000000000000003,7.12,0.221,22.1,1.1200000000000001,1120,1.1399999999999999,206,{"$f":"VLOOKUP(U891,'Powder Core Toroid OD'!$A$2:$B$36,2,FALSE)","v":20.3}]
[79847,"0079847A7",206,40,"KMM",21,"Toroid",5.09,50.9,0.47500000000000003,12,0.83,21.1,0.28000000000000003,7.12,0.221,22.1,1.1200000000000001,1120,1.1399999999999999,206,{"$f":"VLOOKUP(U892,'Powder Core Toroid OD'!$A$2:$B$36,2,FALSE)","v":20.3}]
[79848,"0079848A7",206,60,"KMM",32,"Toroid",5.09,50.9,0.47500000000000003,12,0.83,21.1,0.28000000000000003,7.12,0.221,22.1,1.1200000000000001,1120,1.1399999999999999,{"$f":"C893*1","v":206},{"$f":"VLOOKUP(U893,'Powder Core Toroid OD'!$A$2:$B$36,2,FALSE)","v":20.3}]
[79303,"0079303A7",310,19,"KMM",14,"Toroid",5.67,56.7,0.52500000000000002,13.3,0.93,23.7,0.33,8.39,0.317,31.7,1.8,1800,1.39,310,{"$f":"VLOOKUP(U894,'Powder Core Toroid OD'!$A$2:$B$36,2,FALSE)","v":22.9}]
[79312,"0079312A7",310,26,"KMM",19,"Toroid",5.67,56.7,0.52500000000000002,13.3,0.93,23.7,0.33,8.39,0.317,31.7,1.8,1800,1.39,310,{"$f":"VLOOKUP(U895,'Powder Core Toroid OD'!$A$2:$B$36,2,FALSE)","v":22.9}]
[79316,"0079316A7",310,40,"KMM",29,"Toroid",5.67,56.7,0.52500000000000002,13.3,0.93,23.7,0.33,8.39,0.317,31.7,1.8,1800,1.39,310,{"$f":"VLOOKUP(U896,'Powder Core Toroid OD'!$A$2:$B$36,2,FALSE)","v":22.9}]
[79059,"0079059A7",310,60,"KMM",43,"Toroid",5.67,56.7,0.52500000000000002,13.3,0.93,23.7,0.33,8.39,0.317,31.7,1.8,1800,1.39,{"$f":"C897*1","v":310},{"$f":"VLOOKUP(U897,'Powder Core Toroid OD'!$A$2:$B$36,2,FALSE)","v":22.9}]
[79357,"0079357A7",350,19,"KMM",16,"Toroid",5.88,58.8,0.54200000000000004,13.7,0.95799999999999996,24.4,0.38,9.66,0.38800000000000001,38.800000000000004,2.2814399999999999,2280,1.49,350,{"$f":"VLOOKUP(U898,'Powder Core Toroid OD'!$A$2:$B$36,2,FALSE)","v":23.6}]
[79352,"0079352A7",350,26,"KMM",22,"Toroid",5.88,58.8,0.54200000000000004,13.7,0.95799999999999996,24.4,0.38,9.66,0.38800000000000001,38.800000000000004,2.2814399999999999,2280,1.49,350,{"$f":"VLOOKUP(U899,'Powder Core Toroid OD'!$A$2:$B$36,2,FALSE)","v":23.6}]
[79356,"0079356A7",350,40,"KMM",34,"Toroid",5.88,58.8,0.54200000000000004,13.7,0.95799999999999996,24.4,0.38,9.66,0.38800000000000001,38.800000000000004,2.2814399999999999,2280,1.49,350,{"$f":"VLOOKUP(U900,'Powder Core Toroid OD'!$A$2:$B$36,2,FALSE)","v":23.6}]
[79351,"0079351A7",350,60,"KMM",51,"Toroid",5.88,58.8,0.54200000000000004,13.7,0.95799999999999996,24.4,0.38,9.66,0.38800000000000001,38.800000000000004,2.2814399999999999,2280,1.49,{"$f":"C901*1","v":350},{"$f":"VLOOKUP(U901,'Powder Core Toroid OD'!$A$2:$B$36,2,FALSE)","v":23.6}]
[79937,"0079937A7",930,19,"KMM",23,"Toroid",6.35,63.5,0.55500000000000005,14.1,1.0900000000000001,27.69,0.47,12,0.65400000000000003,65.400000000000006,4.1500000000000004,4150,1.56,930,{"$f":"VLOOKUP(U902,'Powder Core Toroid OD'!$A$2:$B$36,2,FALSE)","v":26.9}]
[79932,"0079932A7",930,26,"KMM",32,"Toroid",6.35,63.5,0.55500000000000005,14.1,1.0900000000000001,27.69,0.47,12,0.65400000000000003,65.400000000000006,4.1500000000000004,4150,1.56,930,{"$f":"VLOOKUP(U903,'Powder Core Toroid OD'!$A$2:$B$36,2,FALSE)","v":26.9}]
[79936,"0079936A7",930,40,"KMM",50,"Toroid",6.35,63.5,0.55500000000000005,14.1,1.0900000000000001,27.69,0.47,12,0.65400000000000003,65.400000000000006,4.1500000000000004,4150,1.56,930,{"$f":"VLOOKUP(U904,'Powder Core Toroid OD'!$A$2:$B$36,2,FALSE)","v":26.9}]
[79894,"0079894A7",930,60,"KMM",75,"Toroid",6.35,63.5,0.55500000000000005,14.1,1.0900000000000001,27.69,0.47,12,0.65400000000000003,65.400000000000006,4.1500000000000004,4150,1.56,{"$f":"C905*1","v":930},{"$f":"VLOOKUP(U905,'Powder Core Toroid OD'!$A$2:$B$36,2,FALSE)","v":26.9}]
[79554,"0079554A7",548,19,"KMM",20,"Toroid",8.14,81.400000000000006,0.76600000000000001,19.399999999999999,1.325,33.659999999999997,0.45,11.5,0.65600000000000003,65.599999999999994,5.34,5340,2.97,548,{"$f":"VLOOKUP(U906,'Powder Core Toroid OD'!$A$2:$B$36,2,FALSE)","v":32.799999999999997}]
[79550,"0079550A7",548,26,"KMM",28,"Toroid",8.14,81.400000000000006,0.76600000000000001,19.399999999999999,1.325,33.659999999999997,0.45,11.5,0.65600000000000003,65.599999999999994,5.34,5340,2.97,548,{"$f":"VLOOKUP(U907,'Powder Core Toroid OD'!$A$2:$B$36,2,FALSE)","v":32.799999999999997}]
[79555,"0079555A7",548,40,"KMM",41,"Toroid",8.14,81.400000000000006,0.76600000000000001,19.399999999999999,1.325,33.659999999999997,0.45,11.5,0.65600000000000003,65.599999999999994,5.34,5340,2.97,548,{"$f":"VLOOKUP(U908,'Powder Core Toroid OD'!$A$2:$B$36,2,FALSE)","v":32.799999999999997}]
[79071,"0079071A7",548,60,"KMM",61,"Toroid",8.14,81.400000000000006,0.76600000000000001,19.399999999999999,1.325,33.659999999999997,0.45,11.5,0.65600000000000003,65.599999999999994,5.34,5340,2.97,{"$f":"C909*1","v":548},{"$f":"VLOOKUP(U909,'Powder Core Toroid OD'!$A$2:$B$36,2,FALSE)","v":32.799999999999997}]
[79592,"0079592A7",585,19,"KMM",12,"Toroid",8.9499999999999993,89.5,0.88800000000000001,22.5,1.385,35.18,0.38500000000000001,9.7799999999999994,0.46400000000000002,46.4,4.1500000000000004,4150,3.99,585,{"$f":"VLOOKUP(U910,'Powder Core Toroid OD'!$A$2:$B$36,2,FALSE)","v":34.299999999999997}]
[79587,"0079587A7",585,26,"KMM",16,"Toroid",8.9499999999999993,89.5,0.88800000000000001,22.5,1.385,35.18,0.38500000000000001,9.7799999999999994,0.46400000000000002,46.4,4.1500000000000004,4150,3.99,585,{"$f":"VLOOKUP(U911,'Powder Core Toroid OD'!$A$2:$B$36,2,FALSE)","v":34.299999999999997}]
[79591,"0079591A7",585,40,"KMM",25,"Toroid",8.9499999999999993,89.5,0.88800000000000001,22.5,1.385,35.18,0.38500000000000001,9.7799999999999994,0.46400000000000002,46.4,4.1500000000000004,4150,3.99,585,{"$f":"VLOOKUP(U912,'Powder Core Toroid OD'!$A$2:$B$36,2,FALSE)","v":34.299999999999997}]
[79586,"0079586A7",585,60,"KMM",38,"Toroid",8.9499999999999993,89.5,0.88800000000000001,22.5,1.385,35.18,0.38500000000000001,9.7799999999999994,0.46400000000000002,46.4,4.1500000000000004,4150,3.99,{"$f":"C913*1","v":585},{"$f":"VLOOKUP(U913,'Powder Core Toroid OD'!$A$2:$B$36,2,FALSE)","v":34.299999999999997}]
[79317,"0079317A7",324,19,"KMM",18,"Toroid",8.98,89.800000000000011,0.84799999999999998,21.5,1.4450000000000001,36.71,0.44700000000000001,11.4,0.67800000000000005,67.800000000000011,6.09,6090,3.64,324,{"$f":"VLOOKUP(U914,'Powder Core Toroid OD'!$A$2:$B$36,2,FALSE)","v":35.799999999999997}]
[79326,"0079326A7",324,26,"KMM",24,"Toroid",8.98,89.800000000000011,0.84799999999999998,21.5,1.4450000000000001,36.71,0.44700000000000001,11.4,0.67800000000000005,67.800000000000011,6.09,6090,3.64,324,{"$f":"VLOOKUP(U915,'Powder Core Toroid OD'!$A$2:$B$36,2,FALSE)","v":35.799999999999997}]
[79330,"0079330A7",324,40,"KMM",37,"Toroid",8.98,89.800000000000011,0.84799999999999998,21.5,1.4450000000000001,36.71,0.44700000000000001,11.4,0.67800000000000005,67.800000000000011,6.09,6090,3.64,324,{"$f":"VLOOKUP(U916,'Powder Core Toroid OD'!$A$2:$B$36,2,FALSE)","v":35.799999999999997}]
[79076,"0079076A7",324,60,"KMM",56,"Toroid",8.98,89.800000000000011,0.84799999999999998,21.5,1.4450000000000001,36.71,0.44700000000000001,11.4,0.67800000000000005,67.800000000000011,6.09,6090,3.64,{"$f":"C917*1","v":324},{"$f":"VLOOKUP(U917,'Powder Core Toroid OD'!$A$2:$B$36,2,FALSE)","v":35.799999999999997}]
[79262,"0079262A7",254,19,"KMM",26,"Toroid",9.84,98.4,0.91800000000000004,23.3,1.605,40.770000000000003,0.60499999999999998,15.4,1.07,107,10.6,10600,4.2699999999999996,254,{"$f":"VLOOKUP(U918,'Powder Core Toroid OD'!$A$2:$B$36,2,FALSE)","v":39.9}]
[79256,"0079256A7",254,26,"KMM",35,"Toroid",9.84,98.4,0.91800000000000004,23.3,1.605,40.770000000000003,0.60499999999999998,15.4,1.07,107,10.6,10600,4.2699999999999996,254,{"$f":"VLOOKUP(U919,'Powder Core Toroid OD'!$A$2:$B$36,2,FALSE)","v":39.9}]
[79260,"0079260A7",254,40,"KMM",54,"Toroid",9.84,98.4,0.91800000000000004,23.3,1.605,40.770000000000003,0.60499999999999998,15.4,1.07,107,10.6,10600,4.2699999999999996,254,{"$f":"VLOOKUP(U920,'Powder Core Toroid OD'!$A$2:$B$36,2,FALSE)","v":39.9}]
[79083,"0079083A7",254,60,"KMM",81,"Toroid",9.84,98.4,0.91800000000000004,23.3,1.605,40.770000000000003,0.60499999999999998,15.4,1.07,107,10.6,10600,4.2699999999999996,{"$f":"C921*1","v":254},{"$f":"VLOOKUP(U921,'Powder Core Toroid OD'!$A$2:$B$36,2,FALSE)","v":39.9}]
[79079,"0079079A7","089",19,"KMM",27,"Toroid",11.6,116,1.0980000000000001,27.88,1.875,47.63,0.63500000000000001,16.100000000000001,1.34,134,15.6,15600,6.1,89,{"$f":"VLOOKUP(U922,'Powder Core Toroid OD'!$A$2:$B$36,2,FALSE)","v":46.7}]
[79091,"0079091A7","089",26,"KMM",37,"Toroid",11.6,116,1.0980000000000001,27.88,1.875,47.63,0.63500000000000001,16.100000000000001,1.34,134,15.6,15600,6.1,89,{"$f":"VLOOKUP(U923,'Powder Core Toroid OD'!$A$2:$B$36,2,FALSE)","v":46.7}]
[79091,"0079091A7","089",40,"KMM",57,"Toroid",11.6,116,1.0980000000000001,27.88,1.875,47.63,0.63500000000000001,16.100000000000001,1.34,134,15.6,15600,6.1,89,{"$f":"VLOOKUP(U924,'Powder Core Toroid OD'!$A$2:$B$36,2,FALSE)","v":46.7}]
[79090,"0079090A7","089",60,"KMM",86,"Toroid",11.6,116,1.0980000000000001,27.88,1.875,47.63,0.63500000000000001,16.100000000000001,1.34,134,15.6,15600,6.1,{"$f":"C925*1","v":89},{"$f":"VLOOKUP(U925,'Powder Core Toroid OD'!$A$2:$B$36,2,FALSE)","v":46.7}]
[79430,"0079430A7",438,19,"KMM",43,"Toroid",10.7,107,0.91800000000000004,23.3,1.875,47.63,0.745,19,1.99,199,21.3,21300,4.2699999999999996,438,{"$f":"VLOOKUP(U926,'Powder Core Toroid OD'!$A$2:$B$38,2,FALSE)","v":46.7}]
[79440,"0079440A7",438,26,"KMM",59,"Toroid",10.7,107,0.91800000000000004,23.3,1.875,47.63,0.745,19,1.99,199,21.3,21300,4.2699999999999996,438,{"$f":"VLOOKUP(U927,'Powder Core Toroid OD'!$A$2:$B$38,2,FALSE)","v":46.7}]
[79431,"0079431A7",438,40,"KMM",90,"Toroid",10.7,107,0.91800000000000004,23.3,1.875,47.63,0.745,19,1.99,199,21.3,21300,4.2699999999999996,438,{"$f":"VLOOKUP(U928,'Powder Core Toroid OD'!$A$2:$B$38,2,FALSE)","v":46.7}]
[79439,"0079439A7",438,60,"KMM",135,"Toroid",10.7,107,0.91800000000000004,23.3,1.875,47.63,0.745,19,1.99,199,21.3,21300,4.2699999999999996,{"$f":"C929*1","v":438},{"$f":"VLOOKUP(U929,'Powder Core Toroid OD'!$A$2:$B$38,2,FALSE)","v":46.7}]
[79750,"0079750A7",725,19,"KMM",56,"Toroid",11.35,113.5,0.94,23.88,2.02,51.31,0.85,21.59,2.62,262,29.7,29700,4.5199999999999996,725,{"$f":"VLOOKUP(U930,'Powder Core Toroid OD'!$A$2:$B$38,2,FALSE)","v":50.55}]
[79727,"0079727A7",725,26,"KMM",76,"Toroid",11.35,113.5,0.94,23.88,2.02,51.31,0.85,21.59,2.62,262,29.7,29700,4.5199999999999996,725,{"$f":"VLOOKUP(U931,'Powder Core Toroid OD'!$A$2:$B$38,2,FALSE)","v":50.55}]
[79733,"0079733A7",725,40,"KMM",117,"Toroid",11.35,113.5,0.94,23.88,2.02,51.31,0.85,21.59,2.62,262,29.7,29700,4.5199999999999996,725,{"$f":"VLOOKUP(U932,'Powder Core Toroid OD'!$A$2:$B$38,2,FALSE)","v":50.55}]
[79726,"0079726A7",725,60,"KMM",175,"Toroid",11.35,113.5,0.94,23.88,2.02,51.31,0.85,21.59,2.62,262,29.7,29700,4.5199999999999996,{"$f":"C933*1","v":725},{"$f":"VLOOKUP(U933,'Powder Core Toroid OD'!$A$2:$B$38,2,FALSE)","v":50.55}]
[79708,"0079708A7",715,19,"KMM",23,"Toroid",12.7,127,1.218,30.93,2.0350000000000001,51.69,0.56500000000000006,14.4,1.25,125,15.9,15900,7.51,{"$f":"C934*1","v":715},{"$f":"VLOOKUP(U934,'Powder Core Toroid OD'!$A$2:$B$36,2,FALSE)","v":50.8}]
[79717,"0079717A7",715,26,"KMM",32,"Toroid",12.7,127,1.218,30.93,2.0350000000000001,51.69,0.56500000000000006,14.4,1.25,125,15.9,15900,7.51,715,{"$f":"VLOOKUP(U935,'Powder Core Toroid OD'!$A$2:$B$36,2,FALSE)","v":50.8}]
[79721,"0079721A7",715,40,"KMM",49,"Toroid",12.7,127,1.218,30.93,2.0350000000000001,51.69,0.56500000000000006,14.4,1.25,125,15.9,15900,7.51,715,{"$f":"VLOOKUP(U936,'Powder Core Toroid OD'!$A$2:$B$36,2,FALSE)","v":50.8}]
[79716,"0079716A7",715,60,"KMM",73,"Toroid",12.7,127,1.218,30.93,2.0350000000000001,51.69,0.56500000000000006,14.4,1.25,125,15.9,15900,7.51,715,{"$f":"VLOOKUP(U937,'Powder Core Toroid OD'!$A$2:$B$36,2,FALSE)","v":50.8}]
[79215,"0079215A7",109,19,"KMM",24,"Toroid",14.3,143,1.3680000000000001,34.74,2.2850000000000001,58.04,0.58499999999999996,14.9,1.44,144,20.7,20700,9.48,{"$f":"C938*1","v":109},{"$f":"VLOOKUP(U938,'Powder Core Toroid OD'!$A$2:$B$36,2,FALSE)","v":57.2}]
[79111,"0079111A7",109,26,"KMM",33,"Toroid",14.3,143,1.3680000000000001,34.74,2.2850000000000001,58.04,0.58499999999999996,14.9,1.44,144,20.7,20700,9.48,109,{"$f":"VLOOKUP(U939,'Powder Core Toroid OD'!$A$2:$B$36,2,FALSE)","v":57.2}]
[79212,"0079212A7",109,40,"KMM",50,"Toroid",14.3,143,1.3680000000000001,34.74,2.2850000000000001,58.04,0.58499999999999996,14.9,1.44,144,20.7,20700,9.48,109,{"$f":"VLOOKUP(U940,'Powder Core Toroid OD'!$A$2:$B$36,2,FALSE)","v":57.2}]
[79110,"0079110A7",109,60,"KMM",75,"Toroid",14.3,143,1.3680000000000001,34.74,2.2850000000000001,58.04,0.58499999999999996,14.9,1.44,144,20.7,20700,9.48,109,{"$f":"VLOOKUP(U941,'Powder Core Toroid OD'!$A$2:$B$36,2,FALSE)","v":57.2}]
[79188,"0079188A7",195,19,"KMM",44,"Toroid",12.5,125,1.0069999999999999,25.57,2.2850000000000001,58.04,0.63500000000000001,16.2,2.29,229,28.6,28600,5.14,{"$f":"C942*1","v":195},{"$f":"VLOOKUP(U942,'Powder Core Toroid OD'!$A$2:$B$36,2,FALSE)","v":57.2}]
[79191,"0079191A7",195,26,"KMM",60,"Toroid",12.5,125,1.0069999999999999,25.57,2.2850000000000001,58.04,0.63500000000000001,16.2,2.29,229,28.6,28600,5.14,195,{"$f":"VLOOKUP(U943,'Powder Core Toroid OD'!$A$2:$B$36,2,FALSE)","v":57.2}]
[79189,"0079189A7",195,40,"KMM",92,"Toroid",12.5,125,1.0069999999999999,25.57,2.2850000000000001,58.04,0.63500000000000001,16.2,2.29,229,28.6,28600,5.14,195,{"$f":"VLOOKUP(U944,'Powder Core Toroid OD'!$A$2:$B$36,2,FALSE)","v":57.2}]
[79192,"0079192A7",195,60,"KMM",138,"Toroid",12.5,125,1.0069999999999999,25.57,2.2850000000000001,58.04,0.63500000000000001,16.2,2.29,229,28.6,28600,5.14,195,{"$f":"VLOOKUP(U945,'Powder Core Toroid OD'!$A$2:$B$36,2,FALSE)","v":57.2}]
[79612,"0079612A7",620,19,"KMM",60,"Toroid",14.4,144,1.248,31.69,2.4769999999999999,62.91,1.02,25.91,3.6,360,51.8,51800,7.89,620,{"$f":"VLOOKUP(U946,'Powder Core Toroid OD'!$A$2:$B$36,2,FALSE)","v":62}]
[79615,"0079615A7",620,26,"KMM",82,"Toroid",14.4,144,1.248,31.69,2.4769999999999999,62.91,1.02,25.91,3.6,360,51.8,51800,7.89,620,{"$f":"VLOOKUP(U947,'Powder Core Toroid OD'!$A$2:$B$36,2,FALSE)","v":62}]
[79616,"0079616A7",620,40,"KMM",126,"Toroid",14.4,144,1.248,31.69,2.4769999999999999,62.91,1.02,25.91,3.6,360,51.8,51800,7.89,620,{"$f":"VLOOKUP(U948,'Powder Core Toroid OD'!$A$2:$B$36,2,FALSE)","v":62}]
[79617,"0079617A7",620,60,"KMM",189,"Toroid",14.4,144,1.248,31.69,2.4769999999999999,62.91,1.02,25.91,3.6,360,51.8,51800,7.89,620,{"$f":"VLOOKUP(U949,'Powder Core Toroid OD'!$A$2:$B$36,2,FALSE)","v":62}]
[79067,"0079067A7","070",19,"KMM",48,"Toroid",15.8,158,1.3660000000000001,34.700000000000003,2.7320000000000002,69.400000000000006,0.84299999999999997,21.4,3.14,314,49.7,49700,9.4499999999999993,70,{"$f":"VLOOKUP(U950,'Powder Core Toroid OD'!$A$2:$B$38,2,FALSE)","v":68}]
[79074,"0079074A7","070",26,"KMM",65,"Toroid",15.8,158,1.3660000000000001,34.700000000000003,2.7320000000000002,69.400000000000006,0.84299999999999997,21.4,3.14,314,49.7,49700,9.4499999999999993,70,{"$f":"VLOOKUP(U951,'Powder Core Toroid OD'!$A$2:$B$38,2,FALSE)","v":68}]
[79073,"0079073A7","070",40,"KMM",100,"Toroid",15.8,158,1.3660000000000001,34.700000000000003,2.7320000000000002,69.400000000000006,0.84299999999999997,21.4,3.14,314,49.7,49700,9.4499999999999993,70,{"$f":"VLOOKUP(U952,'Powder Core Toroid OD'!$A$2:$B$38,2,FALSE)","v":68}]
[79072,"0079072A7","070",60,"KMM",143,"Toroid",15.8,158,1.3660000000000001,34.700000000000003,2.7320000000000002,69.400000000000006,0.84299999999999997,21.4,3.14,314,49.7,49700,9.4499999999999993,70,{"$f":"VLOOKUP(U953,'Powder Core Toroid OD'!$A$2:$B$38,2,FALSE)","v":68}]
[79744,"0079744A7",740,19,"KMM",64,"Toroid",18.399999999999999,184,1.748,44.39,2.9529999999999998,75.010000000000005,1.4139999999999999,35.92,4.97,497,91.4,91400,15.5,740,74.099999999999994]
[79735,"0079735A7",740,26,"KMM",88,"Toroid",18.399999999999999,184,1.748,44.39,2.9529999999999998,75.010000000000005,1.4139999999999999,35.92,4.97,497,91.4,91400,15.5,740,74.099999999999994]
[79736,"0079736A7",740,40,"KMM",136,"Toroid",18.399999999999999,184,1.748,44.39,2.9529999999999998,75.010000000000005,1.4139999999999999,35.92,4.97,497,91.4,91400,15.5,740,74.099999999999994]
[79737,"0079737A7",740,60,"KMM",204,"Toroid",18.399999999999999,184,1.748,44.39,2.9529999999999998,75.010000000000005,1.4139999999999999,35.92,4.97,497,91.4,91400,15.5,740,74.099999999999994]
[79873,"0079873A7",866,19,"KMM",22,"Toroid",19.600000000000001,196,1.8979999999999999,48.2,3.1080000000000001,78.95,0.54500000000000004,13.9,1.76,176,34.5,34500,18.2,{"$f":"C958*1","v":866},{"$f":"VLOOKUP(U958,'Powder Core Toroid OD'!$A$2:$B$36,2,FALSE)","v":77.8}]
[79868,"0079868A7",866,26,"KMM",30,"Toroid",19.600000000000001,196,1.8979999999999999,48.2,3.1080000000000001,78.95,0.54500000000000004,13.9,1.76,176,34.5,34500,18.2,866,{"$f":"VLOOKUP(U959,'Powder Core Toroid OD'!$A$2:$B$36,2,FALSE)","v":77.8}]
[79872,"0079872A7",866,40,"KMM",45,"Toroid",19.600000000000001,196,1.8979999999999999,48.2,3.1080000000000001,78.95,0.54500000000000004,13.9,1.76,176,34.5,34500,18.2,866,{"$f":"VLOOKUP(U960,'Powder Core Toroid OD'!$A$2:$B$36,2,FALSE)","v":77.8}]
[79867,"0079867A7",866,60,"KMM",68,"Toroid",19.600000000000001,196,1.8979999999999999,48.2,3.1080000000000001,78.95,0.54500000000000004,13.9,1.76,176,34.5,34500,18.2,{"$f":"C961*1","v":866},{"$f":"VLOOKUP(U961,'Powder Core Toroid OD'!$A$2:$B$36,2,FALSE)","v":77.8}]
[79913,"0079913A7",906,19,"KMM",27,"Toroid",19.600000000000001,196,1.8979999999999999,48.2,3.1080000000000001,78.95,0.67,17.100000000000001,2.21,221,43.4,43400,18.2,{"$f":"C962*1","v":906},{"$f":"VLOOKUP(U962,'Powder Core Toroid OD'!$A$2:$B$36,2,FALSE)","v":77.8}]
[79908,"0079908A7",906,26,"KMM",37,"Toroid",19.600000000000001,196,1.8979999999999999,48.2,3.1080000000000001,78.95,0.67,17.100000000000001,2.21,221,43.4,43400,18.2,906,{"$f":"VLOOKUP(U963,'Powder Core Toroid OD'!$A$2:$B$36,2,FALSE)","v":77.8}]
[79912,"0079912A7",906,40,"KMM",57,"Toroid",19.600000000000001,196,1.8979999999999999,48.2,3.1080000000000001,78.95,0.67,17.100000000000001,2.21,221,43.4,43400,18.2,906,{"$f":"VLOOKUP(U964,'Powder Core Toroid OD'!$A$2:$B$36,2,FALSE)","v":77.8}]
[79907,"0079907A7",906,60,"KMM",85,"Toroid",19.600000000000001,196,1.8979999999999999,48.2,3.1080000000000001,78.95,0.67,17.100000000000001,2.21,221,43.4,43400,18.2,906,{"$f":"VLOOKUP(U965,'Powder Core Toroid OD'!$A$2:$B$36,2,FALSE)","v":77.8}]
[79097,"0079097A7",102,19,"KMM",35,"Toroid",24.3,243,2.1949999999999998,55.75,4.0549999999999997,103,0.70499999999999996,17.899999999999999,3.58,358,86.9,86900,24.7,102,101.6]
[79102,"0079102A7",102,26,"KMM",48,"Toroid",24.3,243,2.1949999999999998,55.75,4.0549999999999997,103,0.70499999999999996,17.899999999999999,3.58,358,86.9,86900,24.7,102,101.6]
[79100,"0079100A7",102,40,"KMM",74,"Toroid",24.3,243,2.1949999999999998,55.75,4.0549999999999997,103,0.70499999999999996,17.899999999999999,3.58,358,86.9,86900,24.7,102,101.6]
[79099,"0079099A7",102,60,"KMM",111,"Toroid",24.3,243,2.1949999999999998,55.75,4.0549999999999997,103,0.70499999999999996,17.899999999999999,3.58,358,86.9,86900,24.7,102,101.6]
[79342,"0079342A7",337,19,"KMM",50,"Toroid",32.4,324,3.0390000000000001,77.19,5.274,134,1.0549999999999999,26.8,6.78,678,220,220000,47.1,{"$f":"C970*1","v":337},{"$f":"VLOOKUP(U970,'Powder Core Toroid OD'!$A$2:$B$36,2,FALSE)","v":132.6}]
[79337,"0079337A7",337,26,"KMM",68,"Toroid",32.4,324,3.0390000000000001,77.19,5.274,134,1.0549999999999999,26.8,6.78,678,220,220000,47.1,{"$f":"C971*1","v":337},{"$f":"VLOOKUP(U971,'Powder Core Toroid OD'!$A$2:$B$36,2,FALSE)","v":132.6}]
[78056,"0078056A7","050",40,"XFlux",18,"Toroid",3.12,31.2,0.27500000000000002,6.98,0.53,13.5,0.217,5.52,0.109,10.9,0.34,340,0.38300000000000001,50,{"$f":"VLOOKUP(U972,'Powder Core Toroid OD'!$A$2:$B$36,2,FALSE)","v":12.7}]
[78055,"0078055A7","050",75,"XFlux",34,"Toroid",3.12,31.2,0.27500000000000002,6.98,0.53,13.5,0.217,5.52,0.109,10.9,0.34,340,0.38300000000000001,50,{"$f":"VLOOKUP(U973,'Powder Core Toroid OD'!$A$2:$B$36,2,FALSE)","v":12.7}]
[78054,"0078054A7","050",90,"XFlux",40,"Toroid",3.12,31.2,0.27500000000000002,6.98,0.53,13.5,0.217,5.52,0.109,10.9,0.34,340,0.38300000000000001,50,{"$f":"VLOOKUP(U974,'Powder Core Toroid OD'!$A$2:$B$36,2,FALSE)","v":12.7}]
[78113,"0078113A7",120,40,"XFlux",24,"Toroid",4.12,41.2,0.375,9.52,0.68,17.3,0.28000000000000003,7.12,0.192,19.2,0.79100000000000004,791,0.71199999999999997,120,{"$f":"VLOOKUP(U975,'Powder Core Toroid OD'!$A$2:$B$36,2,FALSE)","v":16.600000000000001}]
[78225,"0078225A7",120,75,"XFlux",43,"Toroid",4.12,41.2,0.375,9.52,0.68,17.3,0.28000000000000003,7.12,0.192,19.2,0.79100000000000004,791,0.71199999999999997,{"$f":"C976*1","v":120},{"$f":"VLOOKUP(U976,'Powder Core Toroid OD'!$A$2:$B$36,2,FALSE)","v":16.600000000000001}]
[78224,"0078224A7",120,90,"XFlux",52,"Toroid",4.12,41.2,0.375,9.52,0.68,17.3,0.28000000000000003,7.12,0.192,19.2,0.79100000000000004,791,0.71199999999999997,120,{"$f":"VLOOKUP(U977,'Powder Core Toroid OD'!$A$2:$B$36,2,FALSE)","v":16.600000000000001}]
[78386,"0078386A7",380,40,"XFlux",28,"Toroid",4.1399999999999997,41.4,0.35499999999999998,9.01,0.71,18.100000000000001,0.28000000000000003,7.12,0.23200000000000001,23.200000000000003,0.96048,960,0.63800000000000001,380,{"$f":"VLOOKUP(U978,'Powder Core Toroid OD'!$A$2:$B$36,2,FALSE)","v":17.3}]
[78385,"0078385A7",380,75,"XFlux",53,"Toroid",4.1399999999999997,41.4,0.35499999999999998,9.01,0.71,18.100000000000001,0.28000000000000003,7.12,0.23200000000000001,23.200000000000003,0.96048,960,0.63800000000000001,{"$f":"C979*1","v":380},{"$f":"VLOOKUP(U979,'Powder Core Toroid OD'!$A$2:$B$36,2,FALSE)","v":17.3}]
[78384,"0078384A7",380,90,"XFlux",64,"Toroid",4.1399999999999997,41.4,0.35499999999999998,9.01,0.71,18.100000000000001,0.28000000000000003,7.12,0.23200000000000001,23.200000000000003,0.96048,960,0.63800000000000001,380,{"$f":"VLOOKUP(U980,'Powder Core Toroid OD'!$A$2:$B$36,2,FALSE)","v":17.3}]
[78847,"0078847A7",206,40,"XFlux",21,"Toroid",5.09,50.9,0.47500000000000003,12,0.83,21.1,0.28000000000000003,7.12,0.221,22.1,1.1200000000000001,1120,1.1399999999999999,206,{"$f":"VLOOKUP(U981,'Powder Core Toroid OD'!$A$2:$B$36,2,FALSE)","v":20.3}]
[78211,"0078211A7",206,75,"XFlux",41,"Toroid",5.09,50.9,0.47500000000000003,12,0.83,21.1,0.28000000000000003,7.12,0.221,22.1,1.1200000000000001,1120,1.1399999999999999,{"$f":"C982*1","v":206},{"$f":"VLOOKUP(U982,'Powder Core Toroid OD'!$A$2:$B$36,2,FALSE)","v":20.3}]
[78210,"0078210A7",206,90,"XFlux",49,"Toroid",5.09,50.9,0.47500000000000003,12,0.83,21.1,0.28000000000000003,7.12,0.221,22.1,1.1200000000000001,1120,1.1399999999999999,206,{"$f":"VLOOKUP(U983,'Powder Core Toroid OD'!$A$2:$B$36,2,FALSE)","v":20.3}]
[78316,"0078316A7",310,40,"XFlux",29,"Toroid",5.67,56.7,0.52500000000000002,13.3,0.93,23.7,0.33,8.39,0.317,31.7,1.8,1800,1.39,310,{"$f":"VLOOKUP(U984,'Powder Core Toroid OD'!$A$2:$B$36,2,FALSE)","v":22.9}]
[78315,"0078315A7",310,75,"XFlux",43,"Toroid",5.67,56.7,0.52500000000000002,13.3,0.93,23.7,0.33,8.39,0.317,31.7,1.8,1800,1.39,{"$f":"C985*1","v":310},{"$f":"VLOOKUP(U985,'Powder Core Toroid OD'!$A$2:$B$36,2,FALSE)","v":22.9}]
[78314,"0078314A7",310,90,"XFlux",54,"Toroid",5.67,56.7,0.52500000000000002,13.3,0.93,23.7,0.33,8.39,0.317,31.7,1.8,1800,1.39,310,{"$f":"VLOOKUP(U986,'Powder Core Toroid OD'!$A$2:$B$36,2,FALSE)","v":22.9}]
[78356,"0078356A7",350,40,"XFlux",34,"Toroid",5.88,58.8,0.54200000000000004,13.7,0.95799999999999996,24.4,0.38,9.66,0.38800000000000001,38.800000000000004,2.2814399999999999,2280,1.49,350,{"$f":"VLOOKUP(U987,'Powder Core Toroid OD'!$A$2:$B$36,2,FALSE)","v":23.6}]
[78355,"0078355A7",350,75,"XFlux",62,"Toroid",5.88,58.8,0.54200000000000004,13.7,0.95799999999999996,24.4,0.38,9.66,0.38800000000000001,38.800000000000004,2.2814399999999999,2280,1.49,{"$f":"C988*1","v":350},{"$f":"VLOOKUP(U988,'Powder Core Toroid OD'!$A$2:$B$36,2,FALSE)","v":23.6}]
[78354,"0078354A7",350,90,"XFlux",76,"Toroid",5.88,58.8,0.54200000000000004,13.7,0.95799999999999996,24.4,0.38,9.66,0.38800000000000001,38.800000000000004,2.2814399999999999,2280,1.49,350,{"$f":"VLOOKUP(U989,'Powder Core Toroid OD'!$A$2:$B$36,2,FALSE)","v":23.6}]
[78936,"0078936A7",930,40,"XFlux",50,"Toroid",6.35,63.5,0.55500000000000005,14.1,1.0900000000000001,27.69,0.47,12,0.65400000000000003,65.400000000000006,4.1500000000000004,4150,1.56,930,{"$f":"VLOOKUP(U990,'Powder Core Toroid OD'!$A$2:$B$36,2,FALSE)","v":26.9}]
[78935,"0078935A7",930,75,"XFlux",94,"Toroid",6.35,63.5,0.55500000000000005,14.1,1.0900000000000001,27.69,0.47,12,0.65400000000000003,65.400000000000006,4.1500000000000004,4150,1.56,{"$f":"C991*1","v":930},{"$f":"VLOOKUP(U991,'Powder Core Toroid OD'!$A$2:$B$36,2,FALSE)","v":26.9}]
[78934,"0078934A7",930,90,"XFlux",113,"Toroid",6.35,63.5,0.55500000000000005,14.1,1.0900000000000001,27.69,0.47,12,0.65400000000000003,65.400000000000006,4.1500000000000004,4150,1.56,930,{"$f":"VLOOKUP(U992,'Powder Core Toroid OD'!$A$2:$B$36,2,FALSE)","v":26.9}]
[78555,"0078555A7",548,40,"XFlux",41,"Toroid",8.14,81.400000000000006,0.76600000000000001,19.399999999999999,1.325,33.659999999999997,0.45,11.5,0.65600000000000003,65.599999999999994,5.34,5340,2.97,548,{"$f":"VLOOKUP(U993,'Powder Core Toroid OD'!$A$2:$B$36,2,FALSE)","v":32.799999999999997}]
[78553,"0078553A7",548,75,"XFlux",75,"Toroid",8.14,81.400000000000006,0.76600000000000001,19.399999999999999,1.325,33.659999999999997,0.45,11.5,0.65600000000000003,65.599999999999994,5.34,5340,2.97,{"$f":"C994*1","v":548},{"$f":"VLOOKUP(U994,'Powder Core Toroid OD'!$A$2:$B$36,2,FALSE)","v":32.799999999999997}]
[78552,"0078552A7",548,90,"XFlux",90,"Toroid",8.14,81.400000000000006,0.76600000000000001,19.399999999999999,1.325,33.659999999999997,0.45,11.5,0.65600000000000003,65.599999999999994,5.34,5340,2.97,548,{"$f":"VLOOKUP(U995,'Powder Core Toroid OD'!$A$2:$B$36,2,FALSE)","v":32.799999999999997}]
[78591,"0078591A7",585,40,"XFlux",25,"Toroid",8.9499999999999993,89.5,0.88800000000000001,22.5,1.385,35.18,0.38500000000000001,9.7799999999999994,0.46400000000000002,46.4,4.1500000000000004,4150,3.99,585,{"$f":"VLOOKUP(U996,'Powder Core Toroid OD'!$A$2:$B$36,2,FALSE)","v":34.299999999999997}]
[78590,"0078590A7",585,75,"XFlux",47,"Toroid",8.9499999999999993,89.5,0.88800000000000001,22.5,1.385,35.18,0.38500000000000001,9.7799999999999994,0.46400000000000002,46.4,4.1500000000000004,4150,3.99,{"$f":"C997*1","v":585},{"$f":"VLOOKUP(U997,'Powder Core Toroid OD'!$A$2:$B$36,2,FALSE)","v":34.299999999999997}]
[78589,"0078589A7",585,90,"XFlux",57,"Toroid",8.9499999999999993,89.5,0.88800000000000001,22.5,1.385,35.18,0.38500000000000001,9.7799999999999994,0.46400000000000002,46.4,4.1500000000000004,4150,3.99,585,{"$f":"VLOOKUP(U998,'Powder Core Toroid OD'!$A$2:$B$36,2,FALSE)","v":34.299999999999997}]
[78330,"0078330A7",324,40,"XFlux",37,"Toroid",8.98,89.800000000000011,0.84799999999999998,21.5,1.4450000000000001,36.71,0.44700000000000001,11.4,0.67800000000000005,67.800000000000011,6.09,6090,3.64,324,{"$f":"VLOOKUP(U999,'Powder Core Toroid OD'!$A$2:$B$36,2,FALSE)","v":35.799999999999997}]
[78329,"0078329A7",324,75,"XFlux",70,"Toroid",8.98,89.800000000000011,0.84799999999999998,21.5,1.4450000000000001,36.71,0.44700000000000001,11.4,0.67800000000000005,67.800000000000011,6.09,6090,3.64,{"$f":"C1000*1","v":324},{"$f":"VLOOKUP(U1000,'Powder Core Toroid OD'!$A$2:$B$36,2,FALSE)","v":35.799999999999997}]
[78328,"0078328A7",324,90,"XFlux",84,"Toroid",8.98,89.800000000000011,0.84799999999999998,21.5,1.4450000000000001,36.71,0.44700000000000001,11.4,0.67800000000000005,67.800000000000011,6.09,6090,3.64,324,{"$f":"VLOOKUP(U1001,'Powder Core Toroid OD'!$A$2:$B$36,2,FALSE)","v":35.799999999999997}]
[78260,"0078260A7",254,40,"XFlux",54,"Toroid",9.84,98.4,0.91800000000000004,23.3,1.605,40.770000000000003,0.60499999999999998,15.4,1.07,107,10.6,10600,4.2699999999999996,254,{"$f":"VLOOKUP(U1002,'Powder Core Toroid OD'!$A$2:$B$36,2,FALSE)","v":39.9}]
[78259,"0078259A7",254,75,"XFlux",101,"Toroid",9.84,98.4,0.91800000000000004,23.3,1.605,40.770000000000003,0.60499999999999998,15.4,1.07,107,10.6,10600,4.2699999999999996,{"$f":"C1003*1","v":254},{"$f":"VLOOKUP(U1003,'Powder Core Toroid OD'!$A$2:$B$36,2,FALSE)","v":39.9}]
[78258,"0078258A7",254,90,"XFlux",121,"Toroid",9.84,98.4,0.91800000000000004,23.3,1.605,40.770000000000003,0.60499999999999998,15.4,1.07,107,10.6,10600,4.2699999999999996,254,{"$f":"VLOOKUP(U1004,'Powder Core Toroid OD'!$A$2:$B$36,2,FALSE)","v":39.9}]
[78095,"0078095A7","089",40,"XFlux",57,"Toroid",11.6,116,1.0980000000000001,27.88,1.875,47.63,0.63500000000000001,16.100000000000001,1.34,134,15.6,15600,6.1,89,{"$f":"VLOOKUP(U1005,'Powder Core Toroid OD'!$A$2:$B$36,2,FALSE)","v":46.7}]
[78094,"0078094A7","089",75,"XFlux",107,"Toroid",11.6,116,1.0980000000000001,27.88,1.875,47.63,0.63500000000000001,16.100000000000001,1.34,134,15.6,15600,6.1,{"$f":"C1006*1","v":89},{"$f":"VLOOKUP(U1006,'Powder Core Toroid OD'!$A$2:$B$36,2,FALSE)","v":46.7}]
[78093,"0078093A7","089",90,"XFlux",128,"Toroid",11.6,116,1.0980000000000001,27.88,1.875,47.63,0.63500000000000001,16.100000000000001,1.34,134,15.6,15600,6.1,89,{"$f":"VLOOKUP(U1007,'Powder Core Toroid OD'!$A$2:$B$36,2,FALSE)","v":46.7}]
[78431,"0078431A7",438,40,"XFlux",90,"Toroid",10.7,107,0.91800000000000004,23.3,1.875,47.63,0.745,19,1.99,199,21.3,21300,4.2699999999999996,438,{"$f":"VLOOKUP(U1008,'Powder Core Toroid OD'!$A$2:$B$36,2,FALSE)","v":46.7}]
[78443,"0078443A7",438,75,"XFlux",169,"Toroid",10.7,107,0.91800000000000004,23.3,1.875,47.63,0.745,19,1.99,199,21.3,21300,4.2699999999999996,{"$f":"C1009*1","v":438},{"$f":"VLOOKUP(U1009,'Powder Core Toroid OD'!$A$2:$B$36,2,FALSE)","v":46.7}]
[78442,"0078442A7",438,90,"XFlux",202,"Toroid",10.7,107,0.91800000000000004,23.3,1.875,47.63,0.745,19,1.99,199,21.3,21300,4.2699999999999996,438,{"$f":"VLOOKUP(U1010,'Powder Core Toroid OD'!$A$2:$B$36,2,FALSE)","v":46.7}]
[78727,"0078727A7",725,26,"XFlux",76,"Toroid",11.35,113.5,0.94,23.88,2.02,51.31,0.85,21.59,2.62,262,29.7,29700,4.5199999999999996,725,{"$f":"VLOOKUP(U1011,'Powder Core Toroid OD'!$A$2:$B$38,2,FALSE)","v":50.55}]
[78733,"0078733A7",725,40,"XFlux",117,"Toroid",11.35,113.5,0.94,23.88,2.02,51.31,0.85,21.59,2.62,262,29.7,29700,4.5199999999999996,{"$f":"C1012*1","v":725},{"$f":"VLOOKUP(U1012,'Powder Core Toroid OD'!$A$2:$B$38,2,FALSE)","v":50.55}]
[78726,"0078726A7",725,60,"XFlux",175,"Toroid",11.35,113.5,0.94,23.88,2.02,51.31,0.85,21.59,2.62,262,29.7,29700,4.5199999999999996,725,{"$f":"VLOOKUP(U1013,'Powder Core Toroid OD'!$A$2:$B$38,2,FALSE)","v":50.55}]
[78729,"0078729A7",725,75,"XFlux",219,"Toroid",11.35,113.5,0.94,23.88,2.02,51.31,0.85,21.59,2.62,262,29.7,29700,4.5199999999999996,725,{"$f":"VLOOKUP(U1014,'Powder Core Toroid OD'!$A$2:$B$38,2,FALSE)","v":50.55}]
[78730,"0078730A7",725,90,"XFlux",263,"Toroid",11.35,113.5,0.94,23.88,2.02,51.31,0.85,21.59,2.62,262,29.7,29700,4.5199999999999996,725,{"$f":"VLOOKUP(U1015,'Powder Core Toroid OD'!$A$2:$B$38,2,FALSE)","v":50.55}]
[78721,"0078721A7",715,40,"XFlux",49,"Toroid",12.7,127,1.218,30.93,2.0350000000000001,51.69,0.56500000000000006,14.4,1.25,125,15.9,15900,7.51,715,{"$f":"VLOOKUP(U1016,'Powder Core Toroid OD'!$A$2:$B$36,2,FALSE)","v":50.8}]
[78720,"0078720A7",715,75,"XFlux",91,"Toroid",12.7,127,1.218,30.93,2.0350000000000001,51.69,0.56500000000000006,14.4,1.25,125,15.9,15900,7.51,{"$f":"C1017*1","v":715},{"$f":"VLOOKUP(U1017,'Powder Core Toroid OD'!$A$2:$B$36,2,FALSE)","v":50.8}]
[78719,"0078719A7",715,90,"XFlux",109,"Toroid",12.7,127,1.218,30.93,2.0350000000000001,51.69,0.56500000000000006,14.4,1.25,125,15.9,15900,7.51,715,{"$f":"VLOOKUP(U1018,'Powder Core Toroid OD'!$A$2:$B$36,2,FALSE)","v":50.8}]
[78212,"0078212A7",109,40,"XFlux",50,"Toroid",14.3,143,1.3680000000000001,34.74,2.2850000000000001,58.04,0.58499999999999996,14.9,1.44,144,20.7,20700,9.48,109,{"$f":"VLOOKUP(U1019,'Powder Core Toroid OD'!$A$2:$B$36,2,FALSE)","v":57.2}]
[78214,"0078214A7",109,75,"XFlux",94,"Toroid",14.3,143,1.3680000000000001,34.74,2.2850000000000001,58.04,0.58499999999999996,14.9,1.44,144,20.7,20700,9.48,{"$f":"C1020*1","v":109},{"$f":"VLOOKUP(U1020,'Powder Core Toroid OD'!$A$2:$B$36,2,FALSE)","v":57.2}]
[78213,"0078213A7",109,90,"XFlux",112,"Toroid",14.3,143,1.3680000000000001,34.74,2.2850000000000001,58.04,0.58499999999999996,14.9,1.44,144,20.7,20700,9.48,109,{"$f":"VLOOKUP(U1021,'Powder Core Toroid OD'!$A$2:$B$36,2,FALSE)","v":57.2}]
[78189,"0078189A7",195,40,"XFlux",92,"Toroid",12.5,125,1.0069999999999999,25.57,2.2850000000000001,58.04,0.63500000000000001,16.2,2.29,229,28.6,28600,5.14,195,{"$f":"VLOOKUP(U1022,'Powder Core Toroid OD'!$A$2:$B$36,2,FALSE)","v":57.2}]
[78193,"0078193A7",195,75,"XFlux",172,"Toroid",12.5,125,1.0069999999999999,25.57,2.2850000000000001,58.04,0.63500000000000001,16.2,2.29,229,28.6,28600,5.14,{"$f":"C1023*1","v":195},{"$f":"VLOOKUP(U1023,'Powder Core Toroid OD'!$A$2:$B$36,2,FALSE)","v":57.2}]
[78194,"0078194A7",195,90,"XFlux",207,"Toroid",12.5,125,1.0069999999999999,25.57,2.2850000000000001,58.04,0.63500000000000001,16.2,2.29,229,28.6,28600,5.14,195,{"$f":"VLOOKUP(U1024,'Powder Core Toroid OD'!$A$2:$B$36,2,FALSE)","v":57.2}]
[78616,"0078616A7",620,40,"XFlux",126,"Toroid",14.4,144,1.248,31.69,2.4769999999999999,62.91,1.02,25.91,3.6,360,51.8,51800,7.89,620,{"$f":"VLOOKUP(U1025,'Powder Core Toroid OD'!$A$2:$B$36,2,FALSE)","v":62}]
[78618,"0078618A7",620,75,"XFlux",237,"Toroid",14.4,144,1.248,31.69,2.4769999999999999,62.91,1.02,25.91,3.6,360,51.8,51800,7.89,{"$f":"C1026*1","v":620},{"$f":"VLOOKUP(U1026,'Powder Core Toroid OD'!$A$2:$B$36,2,FALSE)","v":62}]
[78619,"0078619A7",620,90,"XFlux",284,"Toroid",14.4,144,1.248,31.69,2.4769999999999999,62.91,1.02,25.91,3.6,360,51.8,51800,7.89,620,{"$f":"VLOOKUP(U1027,'Powder Core Toroid OD'!$A$2:$B$36,2,FALSE)","v":62}]
[78074,"0078074A7","070",26,"XFlux",65,"Toroid",15.8,158,1.3660000000000001,34.700000000000003,2.7320000000000002,69.400000000000006,0.84299999999999997,21.4,3.14,314,49.7,49700,9.4499999999999993,{"$f":"C1028*1","v":70},{"$f":"VLOOKUP(U1028,'Powder Core Toroid OD'!$A$2:$B$38,2,FALSE)","v":68}]
[78073,"0078073A7","070",40,"XFlux",100,"Toroid",15.8,158,1.3660000000000001,34.700000000000003,2.7320000000000002,69.400000000000006,0.84299999999999997,21.4,3.14,314,49.7,49700,9.4499999999999993,70,{"$f":"VLOOKUP(U1029,'Powder Core Toroid OD'!$A$2:$B$38,2,FALSE)","v":68}]
[78069,"0078069A7","070",75,"XFlux",187,"Toroid",15.8,158,1.3660000000000001,34.700000000000003,2.7320000000000002,69.400000000000006,0.84299999999999997,21.4,3.14,314,49.7,49700,9.4499999999999993,{"$f":"C1030*1","v":70},{"$f":"VLOOKUP(U1030,'Powder Core Toroid OD'!$A$2:$B$38,2,FALSE)","v":68}]
[78068,"0078068A7","070",90,"XFlux",225,"Toroid",15.8,158,1.3660000000000001,34.700000000000003,2.7320000000000002,69.400000000000006,0.84299999999999997,21.4,3.14,314,49.7,49700,9.4499999999999993,70,{"$f":"VLOOKUP(U1031,'Powder Core Toroid OD'!$A$2:$B$38,2,FALSE)","v":68}]
[78736,"0078736A7",740,40,"XFlux",136,"Toroid",18.399999999999999,184,1.748,44.39,2.9529999999999998,75.010000000000005,1.4139999999999999,35.92,4.97,497,91.4,91400,15.5,740,{"$f":"VLOOKUP(U1032,'Powder Core Toroid OD'!$A$2:$B$36,2,FALSE)","v":74.099999999999994}]
[78738,"0078738A7",740,75,"XFlux",255,"Toroid",18.399999999999999,184,1.748,44.39,2.9529999999999998,75.010000000000005,1.4139999999999999,35.92,4.97,497,91.4,91400,15.5,{"$f":"C1033*1","v":740},{"$f":"VLOOKUP(U1033,'Powder Core Toroid OD'!$A$2:$B$36,2,FALSE)","v":74.099999999999994}]
[78739,"0078739A7",740,90,"XFlux",306,"Toroid",18.399999999999999,184,1.748,44.39,2.9529999999999998,75.010000000000005,1.4139999999999999,35.92,4.97,497,91.4,91400,15.5,740,{"$f":"VLOOKUP(U1034,'Powder Core Toroid OD'!$A$2:$B$36,2,FALSE)","v":74.099999999999994}]
[78872,"0078872A7",866,40,"XFlux",45,"Toroid",19.600000000000001,196,1.8979999999999999,48.2,3.1080000000000001,78.95,0.54500000000000004,13.9,1.76,176,34.5,34500,18.2,866,{"$f":"VLOOKUP(U1035,'Powder Core Toroid OD'!$A$2:$B$36,2,FALSE)","v":77.8}]
[78871,"0078871A7",866,75,"XFlux",85,"Toroid",19.600000000000001,196,1.8979999999999999,48.2,3.1080000000000001,78.95,0.54500000000000004,13.9,1.76,176,34.5,34500,18.2,{"$f":"C1036*1","v":866},{"$f":"VLOOKUP(U1036,'Powder Core Toroid OD'!$A$2:$B$36,2,FALSE)","v":77.8}]
[78870,"0078870A7",866,90,"XFlux",102,"Toroid",19.600000000000001,196,1.8979999999999999,48.2,3.1080000000000001,78.95,0.54500000000000004,13.9,1.76,176,34.5,34500,18.2,866,{"$f":"VLOOKUP(U1037,'Powder Core Toroid OD'!$A$2:$B$36,2,FALSE)","v":77.8}]
[78908,"0078908A7",906,26,"XFlux",37,"Toroid",19.600000000000001,196,1.8979999999999999,48.2,3.1080000000000001,78.95,0.67,17.100000000000001,2.21,221,43.4,43400,18.2,906,{"$f":"VLOOKUP(U1038,'Powder Core Toroid OD'!$A$2:$B$36,2,FALSE)","v":77.8}]
[78912,"0078912A7",906,40,"XFlux",57,"Toroid",19.600000000000001,196,1.8979999999999999,48.2,3.1080000000000001,78.95,0.67,17.100000000000001,2.21,221,43.4,43400,18.2,{"$f":"C1039*1","v":906},{"$f":"VLOOKUP(U1039,'Powder Core Toroid OD'!$A$2:$B$36,2,FALSE)","v":77.8}]
[78911,"0078911A7",906,75,"XFlux",106,"Toroid",19.600000000000001,196,1.8979999999999999,48.2,3.1080000000000001,78.95,0.67,17.100000000000001,2.21,221,43.4,43400,18.2,906,{"$f":"VLOOKUP(U1040,'Powder Core Toroid OD'!$A$2:$B$36,2,FALSE)","v":77.8}]
[78910,"0078910A7",906,90,"XFlux",128,"Toroid",19.600000000000001,196,1.8979999999999999,48.2,3.1080000000000001,78.95,0.67,17.100000000000001,2.21,221,43.4,43400,18.2,906,{"$f":"VLOOKUP(U1041,'Powder Core Toroid OD'!$A$2:$B$36,2,FALSE)","v":77.8}]
[78775,"0078775A7",778,26,"XFlux",88,"Toroid",17,170,1.5089999999999999,38.340000000000003,3.1080000000000001,78.95,1.0569999999999999,26.85,4.78,478,81.5,81500,11.5,778,{"$f":"VLOOKUP(U1042,'Powder Core Toroid OD'!$A$2:$B$39,2,FALSE)","v":77.8}]
[78776,"0078776A7",778,40,"XFlux",135,"Toroid",17,170,1.5089999999999999,38.340000000000003,3.1080000000000001,78.95,1.0569999999999999,26.85,4.78,478,81.5,81500,11.5,778,{"$f":"VLOOKUP(U1043,'Powder Core Toroid OD'!$A$2:$B$39,2,FALSE)","v":77.8}]
[78777,"0078777A7",778,60,"XFlux",205,"Toroid",17,170,1.5089999999999999,38.340000000000003,3.1080000000000001,78.95,1.0569999999999999,26.85,4.78,478,81.5,81500,11.5,778,{"$f":"VLOOKUP(U1044,'Powder Core Toroid OD'!$A$2:$B$39,2,FALSE)","v":77.8}]
[78100,"0078100A7",102,40,"XFlux",74,"Toroid",24.3,243,2.1949999999999998,55.75,4.0549999999999997,103,0.70499999999999996,17.899999999999999,3.58,358,86.9,86900,24.7,102,{"$f":"VLOOKUP(U1045,'Powder Core Toroid OD'!$A$2:$B$36,2,FALSE)","v":101.6}]
[78159,"0078159A7",102,75,"XFlux",138,"Toroid",24.3,243,2.1949999999999998,55.75,4.0549999999999997,103,0.70499999999999996,17.899999999999999,3.58,358,86.9,86900,24.7,102,{"$f":"VLOOKUP(U1046,'Powder Core Toroid OD'!$A$2:$B$36,2,FALSE)","v":101.6}]
[78096,"0078096A7",102,90,"XFlux",167,"Toroid",24.3,243,2.1949999999999998,55.75,4.0549999999999997,103,0.70499999999999996,17.899999999999999,3.58,358,86.9,86900,24.7,102,{"$f":"VLOOKUP(U1047,'Powder Core Toroid OD'!$A$2:$B$36,2,FALSE)","v":101.6}]
[78324,"0078324A7",337,19,"XFlux",50,"Toroid",32.4,324,3.0390000000000001,77.19,5.274,134,1.0549999999999999,26.8,6.78,678,220,220000,47.1,337,{"$f":"VLOOKUP(U1048,'Powder Core Toroid OD'!$A$2:$B$36,2,FALSE)","v":132.6}]
[55728,"0055728A2",725,14,"MPP",41,"Toroid",11.35,113.5,0.94,23.88,2.02,51.31,0.85,21.59,2.62,262,29.7,29700,4.5199999999999996,725,{"$f":"VLOOKUP(U1049,'Powder Core Toroid OD'!$A$2:$B$38,2,FALSE)","v":50.55}]
[55727,"0055727A2",725,26,"MPP",76,"Toroid",11.35,113.5,0.94,23.88,2.02,51.31,0.85,21.59,2.62,262,29.7,29700,4.5199999999999996,725,{"$f":"VLOOKUP(U1050,'Powder Core Toroid OD'!$A$2:$B$38,2,FALSE)","v":50.55}]
[55726,"C055726A2",725,60,"MPP",175,"Toroid",11.35,113.5,0.94,23.88,2.02,51.31,0.85,21.59,2.62,262,29.7,29700,4.5199999999999996,725,{"$f":"VLOOKUP(U1051,'Powder Core Toroid OD'!$A$2:$B$38,2,FALSE)","v":50.55}]
[55725,"C055725A2",725,125,"MPP",366,"Toroid",11.35,113.5,0.94,23.88,2.02,51.31,0.85,21.59,2.62,262,29.7,29700,4.5199999999999996,725,{"$f":"VLOOKUP(U1052,'Powder Core Toroid OD'!$A$2:$B$38,2,FALSE)","v":50.55}]
[58728,"0058728A2",725,14,"High FLux",41,"Toroid",11.35,113.5,0.94,23.88,2.02,51.31,0.85,21.59,2.62,262,29.7,29700,4.5199999999999996,{"$f":"C1053*1","v":725},{"$f":"VLOOKUP(U1053,'Powder Core Toroid OD'!$A$2:$B$38,2,FALSE)","v":50.55}]
[58727,"0058727A2",725,26,"High FLux",76,"Toroid",11.35,113.5,0.94,23.88,2.02,51.31,0.85,21.59,2.62,262,29.7,29700,4.5199999999999996,725,{"$f":"VLOOKUP(U1054,'Powder Core Toroid OD'!$A$2:$B$38,2,FALSE)","v":50.55}]
[58726,"C058726A2",725,60,"High FLux",175,"Toroid",11.35,113.5,0.94,23.88,2.02,51.31,0.85,21.59,2.62,262,29.7,29700,4.5199999999999996,725,{"$f":"VLOOKUP(U1055,'Powder Core Toroid OD'!$A$2:$B$38,2,FALSE)","v":50.55}]
[58725,"C058725A2",725,125,"High FLux",366,"Toroid",11.35,113.5,0.94,23.88,2.02,51.31,0.85,21.59,2.62,262,29.7,29700,4.5199999999999996,725,{"$f":"VLOOKUP(U1056,'Powder Core Toroid OD'!$A$2:$B$38,2,FALSE)","v":50.55}]
[77727,"0077727A7",725,26,"Kool Mu",76,"Toroid",11.35,113.5,0.94,23.88,2.02,51.31,0.85,21.59,2.62,262,29.7,29700,4.5199999999999996,{"$f":"C1057*1","v":725},{"$f":"VLOOKUP(U1057,'Powder Core Toroid OD'!$A$2:$B$38,2,FALSE)","v":50.55}]
[77733,"0077733A7",725,40,"Kool Mu",117,"Toroid",11.35,113.5,0.94,23.88,2.02,51.31,0.85,21.59,2.62,262,29.7,29700,4.5199999999999996,725,{"$f":"VLOOKUP(U1058,'Powder Core Toroid OD'!$A$2:$B$38,2,FALSE)","v":50.55}]
[77726,"0077726A7",725,60,"Kool Mu",175,"Toroid",11.35,113.5,0.94,23.88,2.02,51.31,0.85,21.59,2.62,262,29.7,29700,4.5199999999999996,725,{"$f":"VLOOKUP(U1059,'Powder Core Toroid OD'!$A$2:$B$38,2,FALSE)","v":50.55}]
[77729,"0077729A7",725,75,"Kool Mu",219,"Toroid",11.35,113.5,0.94,23.88,2.02,51.31,0.85,21.59,2.62,262,29.7,29700,4.5199999999999996,725,{"$f":"VLOOKUP(U1060,'Powder Core Toroid OD'!$A$2:$B$38,2,FALSE)","v":50.55}]
[77730,"0077730A7",725,90,"Kool Mu",263,"Toroid",11.35,113.5,0.94,23.88,2.02,51.31,0.85,21.59,2.62,262,29.7,29700,4.5199999999999996,725,{"$f":"VLOOKUP(U1061,'Powder Core Toroid OD'!$A$2:$B$38,2,FALSE)","v":50.55}]
[77725,"0077725A7",725,125,"Kool Mu",366,"Toroid",11.35,113.5,0.94,23.88,2.02,51.31,0.85,21.59,2.62,262,29.7,29700,4.5199999999999996,725,{"$f":"VLOOKUP(U1062,'Powder Core Toroid OD'!$A$2:$B$38,2,FALSE)","v":50.55}]
[55075,"0055075A2","070",14,"MPP",35,"Toroid",15.8,158,1.3660000000000001,34.700000000000003,2.7320000000000002,69.400000000000006,0.84299999999999997,21.4,3.14,314,49.7,49700,9.4499999999999993,70,{"$f":"VLOOKUP(U1063,'Powder Core Toroid OD'!$A$2:$B$38,2,FALSE)","v":68}]
[55074,"0055074A2","070",26,"MPP",65,"Toroid",15.8,158,1.3660000000000001,34.700000000000003,2.7320000000000002,69.400000000000006,0.84299999999999997,21.4,3.14,314,49.7,49700,9.4499999999999993,70,{"$f":"VLOOKUP(U1064,'Powder Core Toroid OD'!$A$2:$B$38,2,FALSE)","v":68}]
[55072,"C055072A2","070",60,"MPP",143,"Toroid",15.8,158,1.3660000000000001,34.700000000000003,2.7320000000000002,69.400000000000006,0.84299999999999997,21.4,3.14,314,49.7,49700,9.4499999999999993,70,{"$f":"VLOOKUP(U1065,'Powder Core Toroid OD'!$A$2:$B$38,2,FALSE)","v":68}]
[55070,"C055070A2","070",125,"MPP",312,"Toroid",15.8,158,1.3660000000000001,34.700000000000003,2.7320000000000002,69.400000000000006,0.84299999999999997,21.4,3.14,314,49.7,49700,9.4499999999999993,70,{"$f":"VLOOKUP(U1066,'Powder Core Toroid OD'!$A$2:$B$38,2,FALSE)","v":68}]
[58075,"0058075A2","070",14,"High FLux",35,"Toroid",15.8,158,1.3660000000000001,34.700000000000003,2.7320000000000002,69.400000000000006,0.84299999999999997,21.4,3.14,314,49.7,49700,9.4499999999999993,{"$f":"C1067*1","v":70},{"$f":"VLOOKUP(U1067,'Powder Core Toroid OD'!$A$2:$B$38,2,FALSE)","v":68}]
[58074,"0058074A2","070",26,"High FLux",65,"Toroid",15.8,158,1.3660000000000001,34.700000000000003,2.7320000000000002,69.400000000000006,0.84299999999999997,21.4,3.14,314,49.7,49700,9.4499999999999993,70,{"$f":"VLOOKUP(U1068,'Powder Core Toroid OD'!$A$2:$B$38,2,FALSE)","v":68}]
[58073,"C058073A2","070",40,"High FLux",100,"Toroid",15.8,158,1.3660000000000001,34.700000000000003,2.7320000000000002,69.400000000000006,0.84299999999999997,21.4,3.14,314,49.7,49700,9.4499999999999993,70,{"$f":"VLOOKUP(U1069,'Powder Core Toroid OD'!$A$2:$B$38,2,FALSE)","v":68}]
[58072,"C058072A2","070",60,"High FLux",143,"Toroid",15.8,158,1.3660000000000001,34.700000000000003,2.7320000000000002,69.400000000000006,0.84299999999999997,21.4,3.14,314,49.7,49700,9.4499999999999993,70,{"$f":"VLOOKUP(U1070,'Powder Core Toroid OD'!$A$2:$B$38,2,FALSE)","v":68}]
[58070,"C058070A2","070",125,"High FLux",312,"Toroid",15.8,158,1.3660000000000001,34.700000000000003,2.7320000000000002,69.400000000000006,0.84299999999999997,21.4,3.14,314,49.7,49700,9.4499999999999993,70,{"$f":"VLOOKUP(U1071,'Powder Core Toroid OD'!$A$2:$B$38,2,FALSE)","v":68}]
[55774,"0055774A2",778,14,"MPP",47,"Toroid",17,170,1.5089999999999999,38.340000000000003,3.1080000000000001,78.95,1.0569999999999999,26.85,4.78,478,81.5,81500,11.5,778,{"$f":"VLOOKUP(U1072,'Powder Core Toroid OD'!$A$2:$B$39,2,FALSE)","v":77.8}]
[55775,"0055775A2",778,26,"MPP",88,"Toroid",17,170,1.5089999999999999,38.340000000000003,3.1080000000000001,78.95,1.0569999999999999,26.85,4.78,478,81.5,81500,11.5,778,{"$f":"VLOOKUP(U1073,'Powder Core Toroid OD'!$A$2:$B$39,2,FALSE)","v":77.8}]
[55777,"C055777A2",778,60,"MPP",205,"Toroid",17,170,1.5089999999999999,38.340000000000003,3.1080000000000001,78.95,1.0569999999999999,26.85,4.78,478,81.5,81500,11.5,778,{"$f":"VLOOKUP(U1074,'Powder Core Toroid OD'!$A$2:$B$39,2,FALSE)","v":77.8}]
[55778,"C055778A2",778,125,"MPP",425,"Toroid",17,170,1.5089999999999999,38.340000000000003,3.1080000000000001,78.95,1.0569999999999999,26.85,4.78,478,81.5,81500,11.5,778,{"$f":"VLOOKUP(U1075,'Powder Core Toroid OD'!$A$2:$B$39,2,FALSE)","v":77.8}]
[58774,"0058774A2",778,14,"High FLux",47,"Toroid",17,170,1.5089999999999999,38.340000000000003,3.1080000000000001,78.95,1.0569999999999999,26.85,4.78,478,81.5,81500,11.5,778,{"$f":"VLOOKUP(U1076,'Powder Core Toroid OD'!$A$2:$B$39,2,FALSE)","v":77.8}]
[58775,"0058775A2",778,26,"High FLux",88,"Toroid",17,170,1.5089999999999999,38.340000000000003,3.1080000000000001,78.95,1.0569999999999999,26.85,4.78,478,81.5,81500,11.5,778,{"$f":"VLOOKUP(U1077,'Powder Core Toroid OD'!$A$2:$B$39,2,FALSE)","v":77.8}]
[58776,"C058776A2",778,40,"High FLux",135,"Toroid",17,170,1.5089999999999999,38.340000000000003,3.1080000000000001,78.95,1.0569999999999999,26.85,4.78,478,81.5,81500,11.5,778,{"$f":"VLOOKUP(U1078,'Powder Core Toroid OD'!$A$2:$B$39,2,FALSE)","v":77.8}]
[58777,"C058777A2",778,60,"High FLux",205,"Toroid",17,170,1.5089999999999999,38.340000000000003,3.1080000000000001,78.95,1.0569999999999999,26.85,4.78,478,81.5,81500,11.5,778,{"$f":"VLOOKUP(U1079,'Powder Core Toroid OD'!$A$2:$B$39,2,FALSE)","v":77.8}]
[58778,"C058778A2",778,125,"High FLux",425,"Toroid",17,170,1.5089999999999999,38.340000000000003,3.1080000000000001,78.95,1.0569999999999999,26.85,4.78,478,81.5,81500,11.5,778,{"$f":"VLOOKUP(U1080,'Powder Core Toroid OD'!$A$2:$B$39,2,FALSE)","v":77.8}]
[77774,"0077774A7",778,14,"Kool Mu",47,"Toroid",17,170,1.5089999999999999,38.340000000000003,3.1080000000000001,78.95,1.0569999999999999,26.85,4.78,478,81.5,81500,11.5,778,{"$f":"VLOOKUP(U1081,'Powder Core Toroid OD'!$A$2:$B$39,2,FALSE)","v":77.8}]
[77775,"0077775A7",778,26,"Kool Mu",88,"Toroid",17,170,1.5089999999999999,38.340000000000003,3.1080000000000001,78.95,1.0569999999999999,26.85,4.78,478,81.5,81500,11.5,778,{"$f":"VLOOKUP(U1082,'Powder Core Toroid OD'!$A$2:$B$39,2,FALSE)","v":77.8}]
[77776,"0077776A7",778,40,"Kool Mu",135,"Toroid",17,170,1.5089999999999999,38.340000000000003,3.1080000000000001,78.95,1.0569999999999999,26.85,4.78,478,81.5,81500,11.5,778,{"$f":"VLOOKUP(U1083,'Powder Core Toroid OD'!$A$2:$B$39,2,FALSE)","v":77.8}]
[77777,"0077777A7",778,60,"Kool Mu",205,"Toroid",17,170,1.5089999999999999,38.340000000000003,3.1080000000000001,78.95,1.0569999999999999,26.85,4.78,478,81.5,81500,11.5,778,{"$f":"VLOOKUP(U1084,'Powder Core Toroid OD'!$A$2:$B$39,2,FALSE)","v":77.8}]
[77778,"0077778A7",778,125,"Kool Mu",425,"Toroid",17,170,1.5089999999999999,38.340000000000003,3.1080000000000001,78.95,1.0569999999999999,26.85,4.78,478,81.5,81500,11.5,778,{"$f":"VLOOKUP(U1085,'Powder Core Toroid OD'!$A$2:$B$39,2,FALSE)","v":77.8}]
[78338,"0078338A7",337,40,"XFlux",105,"Toroid",32.4,324,3.0390000000000001,77.19,5.274,134,1.0549999999999999,26.8,6.78,678,220,220000,47.1,337,{"$f":"VLOOKUP(U1086,'Powder Core Toroid OD'!$A$2:$B$36,2,FALSE)","v":132.6}]
[79772,"0079772A7",778,19,"KMM",64,"Toroid",17,170,1.5089999999999999,38.340000000000003,3.1080000000000001,78.95,1.0569999999999999,26.85,4.78,478,81.5,81500,11.5,{"$f":"C1087*1","v":778},{"$f":"VLOOKUP(U1087,'Powder Core Toroid OD'!$A$2:$B$39,2,FALSE)","v":77.8}]
[79775,"0079775A7",778,26,"KMM",88,"Toroid",17,170,1.5089999999999999,38.340000000000003,3.1080000000000001,78.95,1.0569999999999999,26.85,4.78,478,81.5,81500,11.5,778,{"$f":"VLOOKUP(U1088,'Powder Core Toroid OD'!$A$2:$B$39,2,FALSE)","v":77.8}]
[79776,"0079776A7",778,40,"KMM",135,"Toroid",17,170,1.5089999999999999,38.340000000000003,3.1080000000000001,78.95,1.0569999999999999,26.85,4.78,478,81.5,81500,11.5,778,{"$f":"VLOOKUP(U1089,'Powder Core Toroid OD'!$A$2:$B$39,2,FALSE)","v":77.8}]
[79777,"0079777A7",778,60,"KMM",205,"Toroid",17,170,1.5089999999999999,38.340000000000003,3.1080000000000001,78.95,1.0569999999999999,26.85,4.78,478,81.5,81500,11.5,778,{"$f":"VLOOKUP(U1090,'Powder Core Toroid OD'!$A$2:$B$39,2,FALSE)","v":77.8}]
[78057,"0078057A7","050",19,"XFlux",8.8000000000000007,"Toroid",3.12,31.2,0.27500000000000002,6.98,0.53,13.5,0.217,5.52,0.109,10.9,0.34,340,0.38300000000000001,50,12.7]
[78226,"0078226A7","120",19,"XFlux",11,"Toroid",4.12,41.2,0.375,9.52,0.68,17.3,0.28000000000000003,7.12,0.192,19.2,0.79100000000000004,791,0.71199999999999997,120,16.600000000000001]
[78387,"0078387A7",380,19,"XFlux",14,"Toroid",4.1399999999999997,41.4,0.35499999999999998,9.01,0.71,18.100000000000001,0.28000000000000003,7.12,0.23200000000000001,23.200000000000003,0.96,960,0.63800000000000001,380,17.3]
[78849,"0078849A7",206,19,"XFlux",10,"Toroid",5.09,50.9,0.47500000000000003,12,0.83,21.1,0.28000000000000003,7.12,0.221,22.1,1.1200000000000001,1120,1.1399999999999999,206,20.3]
[78303,"0078303A7",310,19,"XFlux",14,"Toroid",5.67,56.7,0.52500000000000002,13.3,0.93,23.7,0.33,8.39,0.317,31.7,1.8,1800,1.39,310,22.9]
[78357,"0078357A7",350,19,"XFlux",16,"Toroid",5.88,58.8,0.54200000000000004,13.7,0.95799999999999996,24.4,0.38,9.66,0.38800000000000001,38.800000000000004,2.2814399999999999,2280,1.49,350,23.6]
[78937,"0078937A7",930,19,"XFlux",23,"Toroid",6.35,63.5,0.55500000000000005,14.1,1.0900000000000001,27.69,0.47,12,0.65400000000000003,65.400000000000006,4.1500000000000004,4150,1.56,930,26.9]
[78554,"0078554A7",548,19,"XFlux",20,"Toroid",8.14,81.400000000000006,0.76600000000000001,19.399999999999999,1.325,33.659999999999997,0.45,11.5,0.65600000000000003,65.599999999999994,5.34,5340,2.97,548,32.799999999999997]
[78592,"0078592A7",585,19,"XFlux",12,"Toroid",8.9499999999999993,89.5,0.88800000000000001,22.5,1.385,35.18,0.38500000000000001,9.7799999999999994,0.46400000000000002,46.4,4.1500000000000004,4150,3.99,585,34.299999999999997]
[78317,"0078317A7",324,19,"XFlux",18,"Toroid",8.98,89.800000000000011,0.84799999999999998,21.5,1.4450000000000001,36.71,0.44700000000000001,11.4,0.67800000000000005,67.800000000000011,6.09,6090,3.64,324,35.799999999999997]
[78262,"0078262A7",254,19,"XFlux",26,"Toroid",9.84,98.4,0.91800000000000004,23.3,1.605,40.770000000000003,0.60499999999999998,15.4,1.07,107,10.6,10600,4.2699999999999996,254,39.9]
[78078,"0078078A7","089",19,"XFlux",27,"Toroid",11.6,116,1.0980000000000001,27.88,1.875,47.63,0.63500000000000001,16.100000000000001,1.34,134,15.6,15600,6.1,89,46.7]
[78430,"0078430A7",438,19,"XFlux",43,"Toroid",10.7,107,0.91800000000000004,23.3,1.875,47.63,0.745,19,1.99,199,21.3,21300,4.2699999999999996,438,46.7]
[78750,"0078750A7",725,19,"XFlux",56,"Toroid",11.35,113.5,0.94,23.88,2.02,51.31,0.85,21.59,2.62,262,29.7,29700,4.5199999999999996,725,50.55]
[78708,"0078708A7",715,19,"XFlux",23,"Toroid",12.7,127,1.218,30.93,2.0350000000000001,51.69,0.56500000000000006,14.4,1.25,125,15.9,15900,7.51,715,50.8]
[78215,"0078215A7",109,19,"XFlux",24,"Toroid",14.3,143,1.3680000000000001,34.74,2.2850000000000001,58.04,0.58499999999999996,14.9,1.44,144,20.7,20700,9.48,109,57.2]
[78188,"0078188A7",195,19,"XFlux",44,"Toroid",12.5,125,1.0069999999999999,25.57,2.2850000000000001,58.04,0.63500000000000001,16.2,2.29,229,28.6,28600,5.14,195,57.2]
[78612,"0078612A7",620,19,"XFlux",60,"Toroid",14.4,144,1.248,31.69,2.4769999999999999,62.91,1.02,25.91,3.6,360,51.8,51800,7.89,620,62]
[78067,"0078067A7","070",19,"XFlux",48,"Toroid",15.8,158,1.3660000000000001,34.700000000000003,2.7320000000000002,69.400000000000006,0.84299999999999997,21.4,3.14,314,49.7,49700,9.4499999999999993,70,68]
[78744,"0078744A7",740,19,"XFlux",64,"Toroid",18.399999999999999,184,1.748,44.39,2.9529999999999998,75.010000000000005,1.4139999999999999,35.92,4.97,497,91.4,91400,15.5,740,74.099999999999994]
[78873,"0078873A7",866,19,"XFlux",22,"Toroid",19.600000000000001,196,1.8979999999999999,48.2,3.1080000000000001,78.95,0.54500000000000004,13.9,1.76,176,34.5,34500,18.2,866,77.8]
[78913,"0078913A7",906,19,"XFlux",27,"Toroid",19.600000000000001,196,1.8979999999999999,48.2,3.1080000000000001,78.95,0.67,17.100000000000001,2.21,221,43.4,43400,18.2,906,77.8]
[78097,"0078097A7",102,19,"XFlux",48,"Toroid",24.3,243,2.1949999999999998,55.75,4.0549999999999997,103,0.70499999999999996,17.899999999999999,3.58,358,86.9,86900,24.7,102,101.6]
[78342,"0078342A7",337,19,"XFlux",50,"Toroid",32.4,324,3.0390000000000001,77.19,5.274,134,1.0549999999999999,26.8,6.78,678,220,220000,47.1,337,132.6]
[78772,"0078772A7",778,19,"XFlux",64,"Toroid",17,170,1.5089999999999999,38.340000000000003,3.1080000000000001,78.95,1.0569999999999999,26.85,4.78,478,81.5,81500,11.5,{"$f":"C1115*1","v":778},{"$f":"VLOOKUP(U1115,'Powder Core Toroid OD'!$A$2:$B$39,2,FALSE)","v":77.8}]
[58100,"C058100A7",102,40,"High Flux",74,"Toroid",24.3,243,2.1949999999999998,55.75,4.0549999999999997,103,0.70499999999999996,17.899999999999999,3.58,358,86.9,86900,24.7,102,101.6]
[58616,"C058616A7",620,40,"High Flux",126,"Toroid",14.4,144,1.248,31.69,2.4769999999999999,62.91,1.02,25.91,3.6,360,51.8,51800,7.89,620,62]
[58736,"C058736A7",740,40,"High Flux",136,"Toroid",18.399999999999999,184,1.748,44.39,2.9529999999999998,75.010000000000005,1.4139999999999999,35.92,4.97,497,91.4,91400,15.5,740,74.099999999999994]
[58095,"C058095A7","089",40,"High Flux",57,"Toroid",11.6,116,1.0980000000000001,27.88,1.875,47.63,0.63500000000000001,16.100000000000001,1.34,134,15.6,15600,6.1,89,46.7]
[58189,"C058189A7",195,40,"High Flux",92,"Toroid",12.5,125,1.0069999999999999,25.57,2.2850000000000001,58.04,0.63500000000000001,16.2,2.29,229,28.6,28600,5.14,195,57.2]
[58212,"C058212A7",109,40,"High Flux",50,"Toroid",14.3,143,1.3680000000000001,34.74,2.2850000000000001,58.04,0.58499999999999996,14.9,1.44,144,20.7,20700,9.48,109,57.2]
[58260,"C058260A7",254,40,"High Flux",54,"Toroid",9.84,98.4,0.91800000000000004,23.3,1.605,40.770000000000003,0.60499999999999998,15.4,1.07,107,10.6,10600,4.2699999999999996,254,39.9]
[58316,"C058316A7",310,40,"High Flux",29,"Toroid",5.67,56.7,0.52500000000000002,13.3,0.93,23.7,0.33,8.39,0.317,31.7,1.8,1800,1.39,310,22.9]
[58330,"C058330A7",324,40,"High Flux",37,"Toroid",8.98,89.800000000000011,0.84799999999999998,21.5,1.4450000000000001,36.71,0.44700000000000001,11.4,0.67800000000000005,67.800000000000011,6.09,6090,3.64,324,35.799999999999997]
[58356,"C058356A7",350,40,"High Flux",34,"Toroid",5.88,58.8,0.54200000000000004,13.7,0.95799999999999996,24.4,0.38,9.66,0.38800000000000001,38.800000000000004,2.2814399999999999,2280,1.49,350,23.6]
[58431,"C058431A7",438,40,"High Flux",90,"Toroid",10.7,107,0.91800000000000004,23.3,1.875,47.63,0.745,19,1.99,199,21.3,21300,4.2699999999999996,438,46.7]
[58555,"C058555A7",548,40,"High Flux",41,"Toroid",8.14,81.400000000000006,0.76600000000000001,19.399999999999999,1.325,33.659999999999997,0.45,11.5,0.65600000000000003,65.599999999999994,5.34,5340,2.97,548,32.799999999999997]
[58591,"C058591A7",585,40,"High Flux",25,"Toroid",8.9499999999999993,89.5,0.88800000000000001,22.5,1.385,35.18,0.38500000000000001,9.7799999999999994,0.46400000000000002,46.4,4.1500000000000004,4150,3.99,585,34.299999999999997]
[58721,"C058721A7",715,40,"High Flux",49,"Toroid",12.7,127,1.218,30.93,2.0350000000000001,51.69,0.56500000000000006,14.4,1.25,125,15.9,15900,7.51,715,50.8]
[58847,"C058847A7",206,40,"High Flux",21,"Toroid",5.09,50.9,0.47500000000000003,12,0.83,21.1,0.28000000000000003,7.12,0.221,22.1,1.1200000000000001,1120,1.1399999999999999,206,20.3]
[58872,"C058872A7",866,40,"High Flux",45,"Toroid",19.600000000000001,196,1.8979999999999999,48.2,3.1080000000000001,78.95,0.54500000000000004,13.9,1.76,176,34.5,34500,18.2,866,77.8]
[58912,"C058912A7",906,40,"High Flux",57,"Toroid",19.600000000000001,196,1.8979999999999999,48.2,3.1080000000000001,78.95,0.67,17.100000000000001,2.21,221,43.4,43400,18.2,906,77.8]
[58936,"C058936A7",930,40,"High Flux",50,"Toroid",6.35,63.5,0.55500000000000005,14.1,1.0900000000000001,27.69,0.47,12,0.65400000000000003,65.400000000000006,4.1500000000000004,4150,1.56,930,26.9]
[58166,"C058166A7",165,40,"High Flux",120,"Toroid",41.2,412,3.9769999999999999,101,6.5549999999999997,166.5,1.3049999999999999,33.15,9.8699999999999992,987,407,407000,80.3,165,165.1]
[58338,"C058338A7",337,40,"High Flux",105,"Toroid",32.4,324,3.0390000000000001,77.19,5.274,134,1.0549999999999999,26.8,6.78,678,220,220000,47.1,337,132.6]
[58073,"C058073A7","070",40,"High Flux",95,"Toroid",15.8,158,1.3660000000000001,34.700000000000003,2.7320000000000002,69.400000000000006,0.84299999999999997,21.4,3.14,314,49.7,49700,9.4499999999999993,70,68]
[58733,"C058733A7",725,40,"High Flux",117,"Toroid",11.35,113.5,0.94,23.88,2.02,51.31,0.85,21.59,2.62,262,29.7,29700,4.5199999999999996,725,50.55]
[58776,"C058776A7",778,40,"High Flux",135,"Toroid",17,170,1.5089999999999999,38.340000000000003,3.1080000000000001,78.95,1.0569999999999999,26.85,4.78,478,81.5,81500,11.5,778,77.8]

{"sheet":"Toroid Design","index":4,"n_rows":121,"n_cols":46,"rows_kept":121,"cut":false,"hidden":true,"merged":[[25,6,25,8],[25,9,25,11],[110,13,110,15],[111,13,111,15],[112,13,112,15],[113,13,113,15],[110,18,110,20],[111,18,111,20],[112,18,112,20],[113,18,113,20],[105,13,105,15],[106,13,106,15],[105,18,105,20],[106,18,106,20],[107,18,107,20],[108,18,108,20],[109,18,109,20],[107,13,107,15],[103,18,103,20],[104,18,104,20],[95,18,95,20],[96,18,96,20],[97,18,97,20],[99,18,99,20],[115,13,115,15],[98,18,98,20],[115,18,115,20],[55,13,55,15],[50,13,50,15],[93,13,93,15],[93,18,93,20],[114,13,114,15],[114,18,114,20],[67,18,67,20],[68,18,68,20],[72,18,72,20],[73,18,73,20],[74,18,74,20],[92,18,92,20],[75,18,75,20],[76,18,76,20],[77,18,77,20],[89,18,89,20],[55,18,55,20],[54,18,54,20],[90,18,90,20],[83,13,83,15],[82,18,82,20],[14,18,14,20],[17,18,17,20],[18,18,18,20],[23,18,23,20],[26,18,26,20],[79,18,79,20],[80,18,80,20],[81,18,81,20],[15,18,15,20],[44,18,44,20],[16,18,16,20],[65,18,65,20],[66,18,66,20],[47,18,47,20],[64,18,64,20],[100,18,100,20],[101,18,101,20],[102,18,102,20],[19,18,19,20],[21,18,21,20],[22,18,22,20],[56,18,56,20],[20,18,20,20],[42,18,42,20],[43,18,43,20],[40,18,40,20],[29,18,29,20],[30,18,30,20],[50,18,50,20],[12,18,12,20],[27,18,27,20],[28,18,28,20],[31,18,31,20],[13,18,13,20],[7,13,7,15],[7,18,7,20],[48,18,48,20],[49,18,49,20],[46,13,46,15],[47,13,47,15],[48,13,48,15],[35,18,35,20],[39,18,39,20],[33,18,33,20],[34,18,34,20],[36,18,36,20],[37,13,37,15],[40,13,40,15],[33,13,33,15],[31,13,31,15],[32,18,32,20],[32,13,32,15],[37,18,37,20],[7,1,7,3],[8,18,8,20],[8,1,8,3],[1,1,1,3],[2,1,2,3],[3,1,3,3],[4,1,4,3],[5,1,5,3],[6,1,6,3],[3,13,3,15],[8,13,8,15],[0,13,0,15],[0,18,0,20],[1,18,1,20],[2,18,2,20],[3,18,3,20],[4,18,4,20],[5,18,5,20],[6,18,6,20],[1,13,1,15],[2,13,2,15],[4,13,4,15],[5,13,5,15],[6,13,6,15],[9,1,9,3],[21,13,21,15],[34,13,34,15],[36,13,36,15],[9,18,9,20],[11,18,11,20],[9,13,9,15],[11,13,11,15],[10,18,10,20],[14,13,14,15],[10,13,10,15],[13,13,13,15],[14,1,14,3],[15,1,15,3],[16,1,16,3],[17,1,17,3],[19,1,19,3],[12,13,12,15],[13,6,13,8],[13,9,13,11],[17,13,17,15],[16,13,16,15],[19,13,19,15],[15,13,15,15],[39,13,39,15],[38,13,38,15],[66,13,66,15],[67,13,67,15],[64,13,64,15],[53,18,53,20],[69,18,69,20],[85,18,85,20],[86,13,86,15],[49,13,49,15],[52,18,52,20],[45,18,45,20],[57,18,57,20],[46,18,46,20],[51,18,51,20],[57,13,57,15],[83,18,83,20],[63,13,63,15],[54,13,54,15],[59,18,59,20],[63,18,63,20],[60,18,60,20],[61,18,61,20],[58,18,58,20],[18,1,18,3],[20,13,20,15],[52,13,52,15],[62,13,62,15],[56,13,56,15],[58,13,58,15],[59,13,59,15],[60,13,60,15],[61,13,61,15],[18,13,18,15],[53,13,53,15],[43,13,43,15],[42,13,42,15],[45,13,45,15],[26,13,26,15],[22,13,22,15],[35,13,35,15],[51,13,51,15],[44,13,44,15],[23,13,23,15],[27,13,27,15],[28,13,28,15],[29,13,29,15],[30,13,30,15],[89,13,89,15],[82,13,82,15],[68,13,68,15],[69,13,69,15],[71,13,71,15],[72,13,72,15],[70,18,70,20],[71,18,71,20],[92,13,92,15],[87,18,87,20],[88,18,88,20],[85,13,85,15],[78,13,78,15],[78,18,78,20],[75,13,75,15],[76,13,76,15],[77,13,77,15],[74,13,74,15],[70,13,70,15],[87,13,87,15],[88,13,88,15],[86,18,86,20],[95,13,95,15],[100,13,100,15],[101,13,101,15],[102,13,102,15],[103,13,103,15],[104,13,104,15],[97,13,97,15],[98,13,98,15],[99,13,99,15],[96,13,96,15],[0,37,0,39],[1,37,1,39],[0,41,0,44],[10,1,10,3],[0,6,0,8],[0,9,0,11],[20,1,20,3],[119,13,119,15],[120,13,120,15],[18,41,18,42],[3,41,4,42],[3,44,4,44],[6,41,7,42],[6,44,7,44],[22,41,23,42],[22,44,23,44],[65,13,65,15],[108,13,108,15],[109,13,109,15],[79,13,79,15],[80,13,80,15],[81,13,81,15],[73,13,73,15],[90,13,90,15],[22,45,23,45],[1,41,1,45],[7,31,8,31],[1,29,1,30],[2,29,2,30],[7,30,8,30],[2,37,2,39],[3,45,4,45],[6,45,7,45],[9,45,10,45],[9,41,10,42],[9,44,10,44],[1,33,1,35],[14,33,14,35]]}
[null,null,null,null,null,null,"MPP",null,null,"HF",null,null,null,"Design #1",null,null,null,null,"Design #2"]
[null,"Inductor Requirements",null,null,null,null,null,55339,null,null,58907,58777,null,"Core Selection",null,null,null,9,"Core Selection",null,null,null,null,null,null,null,null,null,null,"STEP 1",null,null,null,"STEP 2",null,null,null,"STEP 3",null,null,null,"STEP 4"]
[null,"Inductance Required (mH)",null,null,{"$f":"AE14","v":10},null,null,55337,55167,null,null,58776,null,"Part Number",null,null,{"$f":"AM4","v":79097},null,"Part Number",null,null,75439,null,null,null,null,null,null,null,"Design Input",null,null,null,null,null,null,null,"Input a Part Number"]
[null,"DC or AC RMS (Amps)",null,null,{"$f":"AE6","v":5},null,null,55336,55165,null,null,null,null,"Number of Cores (Stack)",null,null,{"$f":"AE17","v":1},null,"Number of Cores (Stack)",null,null,1,null,null,null,null,null,null,"Material Selection",null,"Kool Mu Max",null,null,79777,79737,79100,null,null,79097,null,null,"Inductance at Full Load ",null,null,9.3181510138606551,"mH"]
[null,"RMS Ripple Current (Amps)",null,null,{"$f":"E6/2/1.732","v":1.4434180138568129},null,null,null,55164,null,null,null,null,"Material",null,null,{"$f":"VLOOKUP(Q3,'Powder Core Detail'!$A$2:$T$1546,5,FALSE)","v":"KMM"},{"$f":"VLOOKUP(Q5,'CL Sum'!L2:M7,2,FALSE)","v":6},"Material",null,null,{"$f":"VLOOKUP(V3,'Powder Core Detail'!$A$2:$T$1026,5,FALSE)","v":"MIX"},null,null,null,null,null,null,null,null,null,null,null,79776,79736,79102]
[null,"Pk-Pk Ripple Current (Amps)",null,null,{"$f":"AE8","v":5},"freq index",null,null,null,null,null,null,null,"Permeability",null,null,{"$f":"VLOOKUP(Q3,'Powder Core Detail'!$A$2:$T$1546,4,FALSE)","v":19},null,"Permeability",null,null,{"$f":"VLOOKUP(V3,'Powder Core Detail'!$A$2:$T$1026,4,FALSE)","v":60},null,null,null,null,null,null,"DC Current ",null,5,"Amps",null,null,79735,79097]
[null,"PK-Pk Frequency (kHz)",null,null,{"$f":"AE11","v":10},{"$f":"IF(E7<9,0,IF(E7<10,1,IF(E7<25,2,3)))","v":2},null,null,null,null,null,null,null,"AL (nH/T2) +/- 8%",null,null,{"$f":"(VLOOKUP(Q3,'Powder Core Detail'!$A$2:$T$1546,6,FALSE))*Q4","v":35},null,"AL (nH/T2) +/- 8%",null,null,{"$f":"(VLOOKUP(V3,'Powder Core Detail'!$A$2:$T$1026,6,FALSE))*V4","v":135},null,null,null,null,null,null,null,null,null,null,null,null,null,null,null,null,null,null,null,"Inductance at No Load ",null,null,13.540940000000001,"mH"]
[null,"Specified Current (Amps)",null,null,{"$f":"AE19","v":0},null,null,null,null,null,null,null,null,"Specified Current Inductance MIN(mH)",null,null,{"$f":"IF(E8=0,\"No Value\",(Q43*Q54)*Q49^2/10^6)","v":"No Value"},null,"Specified Current Inductance MIN(mH)",null,null,{"$f":"IF(E8=0,\"No Value\",(V43*V54)*V49^2/10^6)","v":"No Value"},null,0.01,{"$f":"IF(X8=0,\"No Value\",(1/($Q$97+$Q$98*(X8*$Q$22/$Q$45*1.26)^$Q$99))*0.01)","v":0.99999971225333806},null,null,null,"Ripple Current",null,5," Amps            (peak to peak)"]
[null,"Add. Lead Length/ end (mm)",null,null,null,null,null,null,null,null,null,null,null,"Max Current L MIN (mH)",null,null,{"$f":"(Q43*Q51)*Q49^2/10^6","v":9.3181510138606551},null,"Max Current L MIN (mH)",null,null,{"$f":"(V43*V51)*V49^2/10^6","v":0},null,{"$f":"1/1.26*Q$45/Q$22","v":3.1005971520440972E-2},0.99999686436835988]
[null,"Ambient Temperature (°C)",null,null,25,null,null,null,null,null,null,null,null,"Average Current Inductance MIN (mH)",null,null,{"$f":"(Q43*Q50)*Q49^2/10^6","v":10.897483521201508},null,"Average Current Inductance MIN (mH)",null,null,{"$f":"(V43*V50)*V49^2/10^6","v":0},null,{"$f":"2/1.26*Q$45/Q$22","v":6.2011943040881944E-2},0.99998645689686882,null,null,null,null,null,null,null,null,null,null,null,null,null,null,null,null,"Specified Current Inductance",null,null,"No Value","mH"]
[null,"Number of Cores",null,null,{"$f":"AE17","v":1},null,null,null,null,null,null,null,null,"Min Current L MIN (mH)",null,null,{"$f":"(Q43*Q52)*Q49^2/10^6","v":12.057972784040496},null,"Min Current L MIN (mH)",null,null,{"$f":"(V43*V52)*V49^2/10^6","v":0},null,{"$f":"3/1.26*Q$45/Q$22","v":9.3017914561322926E-2},0.99996812912152244,null,null,null,"Frequency ",null,10,"KHz"]
[null,null,null,null,null,null,null,null,null,null,null,null,null,"No Load Inductance (mH) +/- 8%",null,null,{"$f":"(Q7)*Q49^2/10^6","v":13.540940000000001},null,"No Load Inductance (mH) +/- 8%",null,null,{"$f":"(V7)*V49^2/10^6","v":0.14701500000000001},null,{"$f":"4/1.26*Q$45/Q$22","v":0.12402388608176389},0.99994150801883908]
[null,null,null,null,null,null,null,null,null,null,null,null,null,"L +/- 8% if Max Current is low f AC",null,null,{"$f":"(Q7*Q53)*Q49^2/10^6","v":8.6594740638857584},null,"L +/- 8% if Max Current is low f AC",null,null,{"$f":"(V7*V53)*V49^2/10^6","v":0},null,{"$f":"5/1.26*Q$45/Q$22","v":0.15502985760220486},0.99990632290592096,null,null,null,null,null,null,null,null,null,null,null,null,null,null,null,null,"Total Loss",null,null,30.527929149023052,"W"]
[null,null,"Design Criteria",null,null,null,"Kool Mu",null,null,"XFLUX",null,null,null,"Leakage Inductance (uH)",null,null,{"$f":"0.292*(Q22^1.065)*Q94/Q45","v":40.648672235193033},null,"Leakage Inductance (uH)",null,null,{"$f":"0.292*(V22^1.065)*V94/V45","v":2.2494145301107915},null,{"$f":"6/1.26*Q$45/Q$22","v":0.18603582912264585},0.99986235965169956,null,null,null,"Full Load L ",null,10,"mH"]
[null,"LI2 (DC + Peak Ripple)",null,null,562.5,null,77735,77102,77339,78912,78776,78738,null,"Core Loss (W)",null,null,{"$f":"(Q62*Q46)/1000","v":4.4326248842769669},null,"Core Loss (W)",null,null,{"$f":"(V62*V46)/1000","v":{"$error":"#NUM!"}},null,{"$f":"7/1.26*Q$45/Q$22","v":0.21704180064308681},0.99980944058868115,null,null,null,null,null,null,null,null,"Core OD (mm)",null,null,null,null,null,null,null,"Temp Rise",null,null,64.05449191634537,"°C"]
[null,"DC + AC Ripple Current",null,null,{"$f":"IF(E4=0,E6/2,E4+(0.5*E6))","v":7.5},null,null,null,77338,null,null,78736,null,"Copper Loss (W)",null,null,{"$f":"E4^2*Q38/1000+E5^2*Q39/1000","v":26.095304264746087},null,"Copper Loss (W)",null,null,{"$f":"IF(V29=1,#REF!+#REF!,#REF!+#REF!)","v":{"$error":"#REF!"}},null,{"$f":"8/1.26*Q$45/Q$22","v":0.24804777216352777},0.99974741375780651,null,null,null,null,null,null,null,null,77.8,74.099999999999994,101.6]
[null,"DC-AC Ripple Current",null,null,{"$f":"IF(E4=0,E6/2,E4-(0.5*E6))","v":2.5},null,null,null,77337,null,null,78735,null,"Total Loss (W)",null,null,{"$f":"Q15+Q16","v":30.527929149023052},null,"Total Loss (W)",null,null,{"$f":"V15+V16","v":{"$error":"#NUM!"}},null,{"$f":"9/1.26*Q$45/Q$22","v":0.27905374368396879},0.99967614643551717,null,null,null,"Stack Cores",null,1,null,null,null,null,null,null,null,null,null,null,"Number of Turns",null,null,622]
[null,"DC or fundamental AC rms Current",null,null,{"$f":"E4","v":5},null,null,null,77336,null,null,78067,null,"Approximate Fill Factor",null,null,{"$f":"Q33*Q49/Q44","v":0.29639433198380566},null,"Approximate Fill Factor",null,null,{"$f":"V33*V49/V44","v":2.5735362997658084},null,{"$f":"10/1.26*Q$45/Q$22","v":0.31005971520440972},0.99959552091993031]
[null,"Fundamental AC, peak Current",null,null,{"$f":"(E4*SQRT(2))+(E6/2)","v":9.5710678118654755},null,null,null,null,null,null,null,null,"DCR (mΩ, 20° C)",null,null,{"$f":"Q38","v":863.83581680862483},null,"DCR (mΩ)",null,null,{"$f":"V38","v":-1.0773424467654114},null,{"$f":"20/1.26*Q$45/Q$22","v":0.62011943040881945},0.99825533892271301,null,null,null,"Specified Current ",null,null,"Amps",null,null,null,null,null,null,null,null,null,"Wire Size ",null,null,17,"AWG"]
[null,"Specified Current",null,null,{"$f":"E8","v":0},null,null,null,null,null,null,null,null,"Temp Rise (C°)",null,null,{"$f":"(Q17*1000/Q40)^0.833","v":64.05449191634537},null,"Temp Rise (C°)",null,null,{"$f":"V21-E10","v":{"$error":"#REF!"}},null,{"$f":"30/1.26*Q$45/Q$22","v":0.93017914561322923},0.99590389885812669]
[null,"Wire size",null,null,17,null,null,null,null,null,null,null,null,"Operating Temperature (C°)",null,null,{"$f":"Q20+$E$10","v":89.05449191634537},null,"Operating Temperature (C°)",null,null,{"$f":"IF(V29=1,#REF!,#REF!)","v":{"$error":"#REF!"}},null,{"$f":"40/1.26*Q$45/Q$22","v":1.2402388608176389},0.99250794271863318,null,null,null,"Temp Rise",null,null,"°C",null,null,null,null,null,null,null,null,null,"Winding Factor",null,null,0.29639433198380566]
[null,null,null,null,null,null,null,null,null,null,null,null,null,"Number of Turns",null,null,{"$f":"Q49","v":622},null,"Number of Turns",null,null,{"$f":"V49","v":33},null,{"$f":"50/1.26*Q$45/Q$22","v":1.5502985760220487},0.98805460798357381]
[null,null,null,null,null,null,null,null,null,null,null,null,null,"Number of Layers",null,null,{"$f":"COUNTIF(Q73:Q76,\">0\")","v":4},null,"Number of Layers",null,null,{"$f":"COUNTIF(V73:V76,\">0\")","v":2},null,{"$f":"60/1.26*Q$45/Q$22","v":1.8603582912264585},0.98254565143409145,null,null,null,null,null,null,null,null,null,null,null,null,null,null,null,null,"DC Resistance of Winding ",null,null,863.83581680862483,"mΩ"]
[null,null,null,null,null,null,null,null,null,null,null,null,null,"Wire Length (mm)",null,null,{"$f":"(2*E9*Q29)+(Q81*Q29)","v":52093.279474480572},null,"Wire Length (mm)",null,null,{"$f":"(2*E9*V29)+(V81*V29)","v":-5932.6693089283872},null,{"$f":"70/1.26*Q$45/Q$22","v":2.170418006430868},0.97599476182171463]
[null,null,null,null,null,null,null,null,null,null,null,null,null,null,null,null,null,null,null,null,null,null,null,{"$f":"80/1.26*Q$45/Q$22","v":2.4804777216352778},0.96842588721974721]
[null,null,null,null,null,null,"75 Material",null,null,"79 Material",null,null,null,null,null,null,null,null,null,null,null,null,null,{"$f":"90/1.26*Q$45/Q$22","v":2.7905374368396876},0.9598719535478546,null,null,null,"INSTRUCTIONS:",null,null,null,null,null,null,null,null,null,null,null,null,"Finished OD",null,null,113.77273465723678,"mm"]
[null,null,null,null,null,null,null,75338,"-",79777,79737,79100,null,"Winding Selection",null,null,null,null,"Winding Selection",null,null,null,null,{"$f":"100/1.26*Q$45/Q$22","v":3.1005971520440974},0.95037373918396628,null,null,null,"1.  Enter the input parameters in STEP 1."]
[null,null,null,null,null,null,null,75337,"-",79776,79736,79102,null,"Wire AWG",null,null,{"$f":"IF(AS32=0,E21,AS32)","v":17},null,"Wire AWG",null,null,7,null,{"$f":"150/1.26*Q$45/Q$22","v":4.6508957280661463},0.89056268507088898,null,null,null,"  -  Full Load DC Current is the full load or peak bias current.  Enter zero if there is no bias current.",null,null,null,null,null,null,null,null,null,null,null,null,"Finished HT",null,null,28.672734657236781,"mm"]
[null,null,null,null,null,null,null,null,null,null,79735,79097,null,"# of Strands",null,null,{"$f":"IF(AS34=0,1,AS34)","v":1},null,"# of Strands",null,null,3,null,{"$f":"200/1.26*Q$45/Q$22","v":6.2011943040881947},0.8159698756842767,null,null,null,"  -  Full Load L is the inductance required with  full load bias current plus ripple current."]
[null,null,null,null,null,null,null,null,null,null,null,null,null,"Current Skin Depth (mm)",null,null,{"$f":"66.3/SQRT(E7*1000)","v":0.66299999999999992},null,"Skin Depth (mm)",null,null,{"$f":"66.3/SQRT(E7*1000)","v":0.66299999999999992},null,{"$f":"250/1.26*Q$45/Q$22","v":7.7514928801102441},0.73463718674639755,null,null,null,"  -  Specified Current is any RMS or bias current of interest.  ",null,null,null,null,null,null,null,null,null,null,null,null,"Adjust Turns"]
[null,null,null,null,null,null,null,null,null,null,null,null,null,"Bare Wire Radius (mm)",null,null,{"$f":"VLOOKUP(Q28, 'Wire Table'!$A$4:$N$47,14,FALSE)","v":0.57530999999999999},null,"Wire Radius (mm)",null,null,{"$f":"VLOOKUP(V28, 'Wire Table'!$A$4:$N$47,14,FALSE)","v":1.8326100000000001},null,{"$f":"300/1.26*Q$45/Q$22","v":9.3017914561322925},0.65327005345946731]
[null,null,null,null,null,null,null,null,null,null,null,null,null,"Wire Area/ Strand (cm2)",null,null,{"$f":"VLOOKUP(Q28, 'Wire Table'!$A$4:$J$47,5,FALSE)","v":1.1769999999999999E-2},null,"Wire Area/ Strand (cm2)",null,null,{"$f":"VLOOKUP(V28, 'Wire Table'!$A$4:$J$47,5,FALSE)","v":0.111},null,{"$f":"400/1.26*Q$45/Q$22","v":12.402388608176389},0.50655481857366857,null,null,null,"2.  Click \"Suggested Part Numbers\" to find  toroids that fit the input parameters.",null,null,null,null,null,null,null,null,null,null,null,null,"Adjust AWG"]
[null,null,null,null,null,null,null,null,null,null,null,null,null,"Wire Area/ All Strands",null,null,{"$f":"Q32*Q29","v":1.1769999999999999E-2},null,"Wire Area/ All Strands",null,null,{"$f":"V32*V29","v":0.33300000000000002},null,{"$f":"500/1.26*Q$45/Q$22","v":15.502985760220488},0.39060295357612945]
[null,null,null,null,null,null,null,null,null,null,null,null,null,"Circ Mills/strand",null,null,{"$f":"VLOOKUP(Q28, 'Wire Table'!$A$4:$J$47,2,FALSE)","v":2052},null,"Circ Mills/strand",null,null,{"$f":"VLOOKUP(V28, 'Wire Table'!$A$4:$J$47,2,FALSE)","v":20820},null,{"$f":"600/1.26*Q$45/Q$22","v":18.603582912264585},0.30372694348625295,null,null,null,"3.  Enter one of the Suggested Part Numbers (or any part number) in STEP 3.",null,null,null,null,null,null,null,null,null,null,null,null,"Adjust Strand"]
[null,null,null,null,null,null,null,null,null,null,null,null,null,"Resistance (Ω/m) (@20 °C) all strands",null,null,{"$f":"10.371/Q34*3.281/Q29","v":1.6582480994152046E-2},null,"Resistance/m (20 °C)",null,null,{"$f":"10.371/V34*3.281/V29","v":5.447846781940442E-4},null,{"$f":"700/1.26*Q$45/Q$22","v":21.70418006430868},0.2395796117359936]
[null,null,null,null,null,null,null,null,null,null,null,null,null,"Resistance (Ω/mm) (@20 °C)",null,null,{"$f":"Q35/1000","v":1.6582480994152044E-5},null,"Resistance/mm (20 °C)",null,null,{"$f":"V35/1000","v":5.447846781940442E-7},null,{"$f":"800/1.26*Q$45/Q$22","v":24.804777216352779},0.19203572501049718,null,null,null,"4.  Click \"Design Output\" to see the result."]
[null,null,null,null,null,null,null,null,null,null,null,null,null,"MLT (mm)",null,null,{"$f":"Q82","v":83.75125317440606},null,"MLT (mm)",null,null,{"$f":"V82","v":-59.925952615438248},null,{"$f":"900/1.26*Q$45/Q$22","v":27.905374368396878},0.15637561963193655]
[null,null,null,null,null,null,null,null,null,null,null,null,null,"DCR (mΩ, @ 20° C)",null,null,{"$f":"Q37*Q49*Q36*1000","v":863.83581680862483},null,"DCR (mΩ, @ 20° C)",null,null,{"$f":"V37*V49*V36*1000","v":-1.0773424467654114},null,{"$f":"1000/1.26*Q$45/Q$22","v":31.005971520440976},0.12922420235271281,null,null,null,"5.  Adjust turns if desired by entering new turns in the input box in STEP 4, and re-clicking \"Design Output.\""]
[null,null,null,null,null,null,null,null,null,null,null,null,null,"ACR (mΩ, @ 20° C)",null,null,{"$f":"Q38*2.5","v":2159.589542021562}]
[null,null,null,null,null,null,null,null,null,null,null,null,null," Wound Surface Area (cm2)",null,null,{"$f":"0.01*(Q91)","v":207},null," Wound Surface Area (cm2)",null,null,{"$f":"0.01*(V91)","v":231.13278688524596}]
[null,null,null,null,null,null,null,null,null,null,null,null,null,"Adjust Turns",null,null,{"$f":"AS30","v":0},null,"Adjust Turns",null,null,33,null,null,null,null,null,null,"6.  To return to STEP 3, clear the \"Adjust Turns\" box, enter a new part number, and click \"Design Output\"."]
[]
[null,null,null,null,null,null,null,null,null,null,null,null,null,"AL (nH/T2) MIN",null,null,{"$f":"Q7*0.92","v":32.200000000000003},null,"AL (nH/T2) MIN",null,null,{"$f":"V7*0.92","v":124.2},null,null,null,null,null,null,"7. Software is based on current density of 500 Amps/cm^2, when the current is larger than 66.5 Amps, no wire selection is available in the "]
[null,null,null,null,null,null,null,null,null,null,null,null,null,"Window Area (cm2)",null,null,{"$f":"VLOOKUP(Q3,'Powder Core Detail'!$A$2:$T$1546,20,FALSE)","v":24.7},null,"Window Area (cm2)",null,null,{"$f":"VLOOKUP(V3,'Powder Core Detail'!$A$2:$T$1026,20,FALSE)","v":4.2699999999999996},null,null,null,null,null,null,"program. Please consider using multiple wires in a practical application. "]
[null,null,null,null,null,null,null,null,null,null,null,null,null,"Path Length (cm)",null,null,{"$f":"VLOOKUP(Q3,'Powder Core Detail'!$A$2:$T$1546,8,FALSE)","v":24.3},null,"Path Length (cm)",null,null,{"$f":"VLOOKUP(V3,'Powder Core Detail'!$A$2:$T$1026,8,FALSE)","v":10.7}]
[null,null,null,null,null,null,null,null,null,null,null,null,null,"Volume (cm3)",null,null,{"$f":"(VLOOKUP(Q3,'Powder Core Detail'!$A$2:$T$1546,18,FALSE))*Q4","v":86.9},null,"Volume (cm3)",null,null,{"$f":"(VLOOKUP(V3,'Powder Core Detail'!$A$2:$T$1026,18,FALSE))*V4","v":21.3}]
[null,null,null,null,null,null,null,null,null,null,null,null,null,"No Load Turns",null,null,{"$f":"IF(Q41=0,ROUNDUP(SQRT((E3*10^6)/Q43),0),Q41)","v":558},null,"No Load Turns",null,null,{"$f":"IF(V41=0,ROUNDUP(SQRT((E3*10^6)/V43),0),V41)","v":33}]
[null,null,null,null,null,null,null,null,null,null,null,null,null,"% Initial Perm at AVG Current",null,null,{"$f":"0.01*(1/(Q97+Q98*(Q113^Q99)))","v":0.89779094735227749},null,"% Initial Perm at AVG Current",null,null,{"$f":"V97+(V98*V113)+(V99*V113^2)+(V100*V113^3)+(V101*V113^4)","v":0}]
[null,null,null,null,null,null,null,null,null,null,null,null,null,"Adjusted Turns",null,null,{"$f":"IF(Q41=0,ROUNDUP(Q47/Q48,0),Q41)","v":622},null,"Adjusted Turns",null,null,{"$f":"IF(V41=0,ROUNDUP(V47/V48,0),V41)","v":33}]
[null,null,null,null,null,null,null,null,null,null,null,null,null,"% Initial Perm Adj. Turns AVG",null,null,{"$f":"0.01*(1/(Q97+Q98*(Q115^Q99)))","v":0.87476133738977369},null,"% Initial Perm Adj. Turns AVG",null,null,{"$f":"V97+(V98*V115)+(V99*V115^2)+(V100*V115^3)+(V101*V115^4)","v":0}]
[null,null,null,null,null,null,null,null,null,null,null,null,null,"% Initial Perm Max Rip Current",null,null,{"$f":"0.01*(1/(Q97+Q98*(Q111^Q99)))","v":0.74798536992748876},null,"% Initial Perm Max Rip Current",null,null,{"$f":"V97+(V98*V111)+(V99*V111^2)+(V100*V111^3)+(V101*V111^4)","v":0}]
[null,null,null,null,null,null,null,null,null,null,null,null,null,"% Initial Perm Min Rip Current",null,null,{"$f":"0.01*(1/(Q97+Q98*(Q112^Q99)))","v":0.96791597603753921},null,"% Initial Perm Min Rip Current",null,null,{"$f":"V97+(V98*V112)+(V99*V112^2)+(V100*V112^3)+(V101*V112^4)","v":0}]
[null,null,null,null,null,null,null,null,null,null,null,null,null,"% Intial Perm MAX Current AC low f",null,null,{"$f":"0.01*(1/(Q97+Q98*(Q114^Q99)))","v":0.63950317067247597},null,"% Intial Perm MAX Current AC low f",null,null,{"$f":"V97+(V98*V114)+(V99*V114^2)+(V100*V114^3)+(V101*V114^4)","v":0}]
[null,null,null,null,null,null,null,null,null,null,null,null,null,"% Intial Perm Spec. Current",null,null,{"$f":"0.01*(1/(Q97+Q98*(Q116^Q99)))","v":1},null,"% Intial Perm Spec. Current",null,null,{"$f":"V97+(V98*V116)+(V99*V116^2)+(V100*V116^3)+(V101*V116^4)","v":0}]
[null,null,null,null,null,null,null,null,null,null,null,null,null,"Core Loss",null,null,null,null,"Core Loss"]
[null,null,null,null,null,null,null,null,null,null,null,null,null,"HAC MAX",null,null,{"$f":"(Q49/Q45)*(E16)","v":191.97530864197529},null,"HAC MAX",null,null,{"$f":"(V49/V45)*(E16)","v":23.13084112149533}]
[null,null,null,null,null,null,null,null,null,null,null,null,null,"HAC MIN",null,null,{"$f":"(Q49/Q45)*(E17)","v":63.991769547325099},null,"HAC MIN",null,null,{"$f":"(V49/V45)*(E17)","v":7.7102803738317762}]
[null,null,null,null,null,null,null,null,null,null,null,null,null,"ABS HAC MIN",null,null,{"$f":"ABS(Q57)","v":63.991769547325099},null,"ABS HAC MIN",null,null,{"$f":"ABS(V57)","v":7.7102803738317762}]
[null,null,null,null,null,null,null,null,null,null,null,null,null,"BAC MAX",null,null,{"$f":"((Q102+(Q103*Q56)+(Q104*Q56^2))/(1+(Q105*Q56)+(Q106*Q56^2)))^Q107","v":0.34455983270368923},null,"BAC MAX",null,null,{"$f":"((V102+(V103*V111)+(V104*V111^2))/(1+(V105*V111)+(V106*V111^2)))^V107","v":{"$error":"#NUM!"}}]
[null,null,null,null,null,null,null,null,null,null,null,null,null,"BAC MIN",null,null,{"$f":"IF(Q57<0,-(((Q102+(Q103*Q58)+(Q104*Q58^2))/(1+(Q105*Q58)+(Q106*Q58^2)))^Q107),((Q102+(Q103*Q57)+(Q104*Q57^2))/(1+(Q105*Q57)+(Q106*Q57^2)))^Q107)","v":0.11932470195281011},null,"BAC MIN",null,null,{"$f":"IF(V57<0,-(((V102+(V103*V58)+(V104*V58^2))/(1+(V105*V58)+(V106*V58^2)))^V107),((V102+(V103*V57)+(V104*V57^2))/(1+(V105*V57)+(V106*V57^2)))^V107)","v":{"$error":"#NUM!"}}]
[null,null,null,null,null,null,null,null,null,null,null,null,null,"B Peak (DeltaB/2)",null,null,{"$f":"(Q59-Q60)/2","v":0.11261756537543956},null,"B Peak (DeltaB/2)",null,null,{"$f":"(V59-V60)/2","v":{"$error":"#NUM!"}}]
[null,null,null,null,null,null,null,null,null,null,null,null,null,"Core Loss (mW/cm3)",null,null,{"$f":"Q108*(Q61^Q109)*($E$7^Q110)","v":51.008341591219406},null,"Core Loss (mW/cm3)",null,null,{"$f":"V108*(V61^V109)*($E$7^V110)","v":{"$error":"#NUM!"}}]
[]
[null,null,null,null,null,null,null,null,null,null,null,null,null,"Core Info"]
[null,null,null,null,null,null,null,null,null,null,null,null,null,"OD MAX (mm)",null,null,{"$f":"VLOOKUP(Q3,'Powder Core Detail'!$A$2:$T$1546,13,FALSE)","v":103},null,"OD MAX (mm)",null,null,{"$f":"VLOOKUP(V3,'Powder Core Detail'!$A$2:$T$1026,13,FALSE)","v":47.63}]
[null,null,null,null,null,null,null,null,null,null,null,null,null,"ID MIN (mm)",null,null,{"$f":"VLOOKUP(Q3,'Powder Core Detail'!$A$2:$T$1546,11,FALSE)","v":55.75},null,"ID MIN (mm)",null,null,{"$f":"VLOOKUP(V3,'Powder Core Detail'!$A$2:$T$1026,11,FALSE)","v":23.3}]
[null,null,null,null,null,null,null,null,null,null,null,null,null,"Stacked HT MAX (mm)",null,null,{"$f":"Q4*(VLOOKUP(Q3,'Powder Core Detail'!$A$2:$T$1546,15,FALSE))","v":17.899999999999999},{"$f":"(VLOOKUP(Q3,'Powder Core Detail'!$A$2:$T$1546,15,FALSE))","v":17.899999999999999},"HT MAX (mm)",null,null,{"$f":"V4*(VLOOKUP(V3,'Powder Core Detail'!$A$2:$T$1026,15,FALSE))","v":19}]
[null,null,null,null,null,null,null,null,null,null,null,null,null,"Window Area (mm2)",null,null,{"$f":"100*(VLOOKUP(Q3,'Powder Core Detail'!$A$2:$T$1546,20,FALSE))","v":2470},null,"Window Area (mm2)",null,null,{"$f":"100*(VLOOKUP(V3,'Powder Core Detail'!$A$2:$T$1026,20,FALSE))","v":426.99999999999994}]
[null,null,null,null,null,null,null,null,null,null,null,null,null,"Core Winding Circumference (mm)",null,null,{"$f":"Q65-Q66+(2*Q67)","v":83.05},null,"Core Winding Circumference (mm)",null,null,{"$f":"V65-V66+(2*V67)","v":62.33}]
[null,null,null,null,null,null,null,null,null,null,null,null,null,"First Layer Circumference (mm)",null,null,{"$f":"2*PI()*((Q66/2)-(Q71/2))","v":171.29793315828468},null,"First Layer Circumference (mm)",null,null,{"$f":"2*PI()*((V66/2)-(V71/2))","v":52.742810496388607}]
[null,null,null,null,null,null,null,null,null,null,null,null,null,"Wire OD (mm)",null,null,{"$f":"SQRT((4*Q33*100)/PI())","v":1.2241743928678162},null,"Wire OD (mm)",null,null,{"$f":"SQRT((4*V33*100)/PI())","v":6.5114419938813031}]
[null,null,null,null,null,null,null,null,null,null,null,null,null,"# of Turns possible on layer 1",null,null,{"$f":"ROUNDDOWN(Q70/Q71,0)","v":139},null,"# of Turns possible on layer 1",null,null,{"$f":"ROUNDDOWN(V70/V71,0)","v":8}]
[null,null,null,null,null,null,null,null,null,null,null,null,null,"Turns on Layer 1",null,null,{"$f":"IF(Q72>Q49, Q49,Q72)","v":139},null,"Turns on Layer 1",null,null,{"$f":"IF(V72>V49, V49,V72)","v":8}]
[null,null,null,null,null,null,null,null,null,null,null,null,null,"Turns on Layer 2",null,null,{"$f":"IF(Q49-(Q73)<=0,0,IF(Q49-(Q73)>=Q73-6,Q73-6,(Q49-(Q73))))","v":133},null,"Turns on Layer 2",null,null,{"$f":"IF(V49-(V73)<=0,0,IF(V49-(V73)>=V73-6,V73-6,(V49-(V73))))","v":2}]
[null,null,null,null,null,null,null,null,null,null,null,null,null,"Turns on Layer 3",null,null,{"$f":"IF(Q49-(Q74+Q73)<=0,0,IF(Q49-(Q74+Q73)>=Q74-6,Q74-6,(Q49-(Q73+Q74))))","v":127},null,"Turns on Layer 3",null,null,{"$f":"IF(V49-(V74+V73)<=0,0,IF(V49-(V74+V73)>=V74-6,V74-6,(V49-(V73+V74))))","v":-4}]
[null,null,null,null,null,null,null,null,null,null,null,null,null,"Turns on Layer 4",null,null,{"$f":"IF(Q49-(Q75+Q74+Q73)<=0,0,IF(Q49-(Q75+Q74+Q73)>=Q75-6,Q75-6,(Q49-(Q74+Q75+Q73))))","v":121},null,"Turns on Layer 4",null,null,{"$f":"IF(V49-(V75+V74+V73)<=0,0,IF(V49-(V75+V74+V73)>=V75-6,V75-6,(V49-(V74+V75+V73))))","v":-10}]
[null,null,null,null,null,null,null,null,null,null,null,null,null,"Length per turn Layer 1 (mm)",null,null,{"$f":"Q69+(8*Q71/2)","v":87.946697571471262},null,"Length per turn Layer 1 (mm)",null,null,{"$f":"V69+(8*V71/2)","v":88.375767975525207}]
[null,null,null,null,null,null,null,null,null,null,null,null,null,"Length per turn Layer 2",null,null,{"$f":"Q69+8*((Q71/2)+(SQRT(3)*(Q71/2)))","v":96.428026554558627},null,"Length per turn Layer 2",null,null,{"$f":"V69+8*((V71/2)+(SQRT(3)*(V71/2)))","v":133.48836143128526}]
[null,null,null,null,null,null,null,null,null,null,null,null,null,"Length per turn Layer 3",null,null,{"$f":"Q69+(8*(Q71/2)+(16*(SQRT(3)*(Q71/2))))","v":104.90935553764599},null,"Length per turn Layer 3",null,null,{"$f":"V69+(8*(V71/2)+(16*(SQRT(3)*(V71/2))))","v":178.6009548870453}]
[null,null,null,null,null,null,null,null,null,null,null,null,null,"Length per turn Layer 4",null,null,{"$f":"Q69+(8*(Q71/2)+(24*(SQRT(3)*(Q71/2))))","v":113.39068452073334},null,"Length per turn Layer 4",null,null,{"$f":"V69+(8*(V71/2)+(24*(SQRT(3)*(V71/2))))","v":223.71354834280532}]
[null,null,null,null,null,null,null,null,null,null,null,null,null,"Total wire length (mm)",null,null,{"$f":"(Q73*Q77)+(Q74*Q78)+(Q75*Q79)+(Q76*Q80)","v":52093.279474480572},null,"Total wire length (mm)",null,null,{"$f":"(V73*V77)+(V74*V78)+(V75*V79)+(V76*V80)","v":-1977.5564363094622}]
[null,null,null,null,null,null,null,null,null,null,null,null,null,"MLT (mm)",null,null,{"$f":"Q81/Q49","v":83.75125317440606},null,"MLT (mm)",null,null,{"$f":"V81/V49","v":-59.925952615438248}]
[null,null,null,null,null,null,null,null,null,null,null,null,null,"Feet/Pound",null,null,{"$f":"VLOOKUP(Q28, 'Wire Table'!$A$4:$K$47,11,FALSE)","v":157.69999999999999},null,"Feet/Pound",null,null,{"$f":"VLOOKUP(V28, 'Wire Table'!$A$4:$K$47,11,FALSE)","v":15.75}]
[null,null,null,null,null,null,null,null,null,null,null,null,null,"Pounds of Wire",null,null,{"$f":"(Q24/304.8)/Q83","v":1.0837648038170207},null,"Pounds of Wire",null,null,{"$f":"(V24/304.8)/V83","v":-1.2358182954064882}]
[]
[null,null,null,null,null,null,null,null,null,null,null,null,null,"Surface Area",null,null,null,null,"Surface Area"]
[null,null,null,null,null,null,null,null,null,null,null,null,null,"Base Part Number",null,null,{"$f":"VLOOKUP(Q3,'Powder Core Detail'!$A$2:$T$1546,3,FALSE)","v":102},null,"Base Part Number",null,null,{"$f":"VLOOKUP(V3,'Powder Core Detail'!$A$2:$T$1026,3,FALSE)","v":438}]
[null,null,null,null,null,null,null,null,null,null,null,null,null,"Single Toroid Surface Area",null,null,{"$f":"VLOOKUP(Q87,'Surface Area'!$A$2:$F$50,6,FALSE)","v":20700},null,"Single Toroid Surface Area",null,null,{"$f":"VLOOKUP(--V87,'Surface Area'!$A$2:$G$37,7,FALSE)","v":23113.278688524595}]
[null,null,null,null,null,null,null,null,null,null,null,null,null,"Stacking Surface Area",null,null,{"$f":"(Q90*PI()*(Q65+Q66))","v":8927.2282242570964},null,"Stacking Surface Area",null,null,{"$f":"(V90*PI()*(V65+V66))","v":4233.8301714633562}]
[null,null,null,null,null,null,null,null,null,null,null,null,null,"Core Ht for SA",null,null,{"$f":"(VLOOKUP(Q3,'Powder Core Detail'!$A$2:$T$1546,15,FALSE))","v":17.899999999999999},null,"Core Ht for SA",null,null,{"$f":"(VLOOKUP(V3,'Powder Core Detail'!$A$2:$T$1026,15,FALSE))","v":19}]
[null,null,null,null,null,null,null,null,null,null,null,null,null,"Total Surface Area",null,null,{"$f":"Q88+(Q4-1)*(Q89)","v":20700},null,"Total Surface Area",null,null,{"$f":"V88+(V4-1)*(V89)","v":23113.278688524595}]
[]
[null,null,null,null,null,null,null,null,null,null,null,null,null,"Part Number",null,null,{"$f":"VLOOKUP(Q3,'Powder Core Detail'!$A$2:$T$1546,2,FALSE)","v":"0079097A7"},null,"Part Number",null,null,{"$f":"VLOOKUP(V3,'Powder Core Detail'!$A$2:$T$1026,2,FALSE)","v":"0075439A7"}]
[null,null,null,null,null,null,null,null,null,null,null,null,null,"Cross Section (cm2)",null,null,{"$f":"VLOOKUP(Q3,'Powder Core Detail'!$A$2:$T$1546,16,FALSE)*Q4","v":3.58},null,"Cross Section (cm2)",null,null,{"$f":"VLOOKUP(V3,'Powder Core Detail'!$A$2:$T$1026,16,FALSE)*V4","v":1.99}]
[]
[null,null,null,null,null,null,null,null,null,null,null,null,null,"Equations",null,null,null,null,"Equations"]
[null,null,null,null,null,null,null,null,null,null,null,null,null,"DC A",null,null,{"$f":"IF($Q$5=\"Kool Mu\",VLOOKUP($Q$6,'Kool Mu CF Constants'!$A$3:$F$9,2,FALSE),IF($Q$5=\"MPP\",VLOOKUP($Q$6,'MPP CF'!$A$3:$F$12,2,FALSE),IF($Q$5=\"High Flux\",VLOOKUP($Q$6,'HF CF'!$A$3:$F$9,2,FALSE),IF($Q$5=\"XFlux\",VLOOKUP($Q$6,'XF CF'!$A$3:$D$8,2,FALSE),IF($Q$5=\"MIX\", VLOOKUP($Q$6,'75 CF'!A2:D6,2,FALSE),IF($Q$5=\"KMM\",VLOOKUP($Q$6,'79 CF'!$A$3:$D$6,2,FALSE)))))))","v":0.01},null,"DC A",null,null,{"$f":"IF($V$5=\"Kool Mu\",VLOOKUP($V$6,#REF!,2,FALSE),IF($V$5=\"MPP\",VLOOKUP($V$6,#REF!,2,FALSE),IF($V$5=\"High Flux\",VLOOKUP($V$6,#REF!,2,FALSE),IF($V$5=\"XFlux\",VLOOKUP($V$6,#REF!,2,FALSE)))))","v":false}]
[null,null,null,null,null,null,null,null,null,null,null,null,null,"DC B",null,null,{"$f":"IF($Q$5=\"Kool Mu\",VLOOKUP($Q$6,'Kool Mu CF Constants'!$A$3:$F$9,3,FALSE),IF($Q$5=\"MPP\",VLOOKUP($Q$6,'MPP CF'!$A$3:$F$12,3,FALSE),IF($Q$5=\"High Flux\",VLOOKUP($Q$6,'HF CF'!$A$3:$F$9,3,FALSE),IF($Q$5=\"XFlux\",VLOOKUP($Q$6,'XF CF'!$A$3:$D$8,3,FALSE),IF($Q$5=\"MIX\",VLOOKUP($Q$6,'75 CF'!A2:D6,3,FALSE),IF($Q$5=\"KMM\",VLOOKUP($Q$6,'79 CF'!$A$3:$D$6,3,FALSE)))))))","v":3.1356414722723549E-8},null,"DC B",null,null,{"$f":"IF($V$5=\"Kool Mu\",VLOOKUP($V$6,#REF!,3,FALSE),IF($V$5=\"MPP\",VLOOKUP($V$6,#REF!,3,FALSE),IF($V$5=\"High Flux\",VLOOKUP($V$6,#REF!,3,FALSE),IF($V$5=\"XFlux\",VLOOKUP($V$6,#REF!,3,FALSE)))))","v":false}]
[null,null,null,null,null,null,null,null,null,null,null,null,null,"DC C",null,null,{"$f":"IF($Q$5=\"Kool Mu\",VLOOKUP($Q$6,'Kool Mu CF Constants'!$A$3:$F$9,4,FALSE),IF($Q$5=\"MPP\",VLOOKUP($Q$6,'MPP CF'!$A$3:$F$12,4,FALSE),IF($Q$5=\"High Flux\",VLOOKUP($Q$6,'HF CF'!$A$3:$F$9,4,FALSE),IF($Q$5=\"XFlux\",VLOOKUP($Q$6,'XF CF'!$A$3:$D$8,4,FALSE),IF($Q$5=\"MIX\", VLOOKUP($Q$6,'75 CF'!A2:D6,4,FALSE),IF($Q$5=\"KMM\",VLOOKUP($Q$6,'79 CF'!$A$3:$D$6,4,FALSE)))))))","v":2.1107453632639701},null,"DC C",null,null,{"$f":"IF($V$5=\"Kool Mu\",VLOOKUP($V$6,#REF!,4,FALSE),IF($V$5=\"MPP\",VLOOKUP($V$6,#REF!,4,FALSE),IF($V$5=\"High Flux\",VLOOKUP($V$6,#REF!,4,FALSE),IF($V$5=\"XFlux\",VLOOKUP($V$6,#REF!,4,FALSE)))))","v":false}]
[null,null,null,null,null,null,null,null,null,null,null,null,null,"DC D",null,null,null,null,"DC D",null,null,{"$f":"IF($V$5=\"Kool Mu\",VLOOKUP($V$6,#REF!,5,FALSE),IF($V$5=\"MPP\",VLOOKUP($V$6,#REF!,5,FALSE),IF($V$5=\"High Flux\",VLOOKUP($V$6,#REF!,5,FALSE),IF($V$5=\"XFlux\",VLOOKUP($V$6,#REF!,5,FALSE)))))","v":false}]
[null,null,null,null,null,null,null,null,null,null,null,null,null,"DC E",null,null,null,null,"DC E",null,null,{"$f":"IF($V$5=\"Kool Mu\",VLOOKUP($V$6,#REF!,6,FALSE),IF($V$5=\"MPP\",VLOOKUP($V$6,#REF!,6,FALSE),IF($V$5=\"High Flux\",VLOOKUP($V$6,#REF!,6,FALSE),IF($V$5=\"XFlux\",VLOOKUP($V$6,#REF!,6,FALSE)))))","v":false}]
[null,null,null,null,null,null,null,null,null,null,null,null,null,"NM A",null,null,{"$f":"IF($Q$5=\"Kool Mu\",VLOOKUP($Q$6,'Kool Mu CF Constants'!$A$16:$G$22,2,FALSE),IF($Q$5=\"MPP\",VLOOKUP($Q$6,'MPP CF'!$A$14:$G$23,2,FALSE),IF($Q$5=\"High Flux\",VLOOKUP($Q$6,'HF CF'!$A$11:$G$17,2,FALSE),IF($Q$5=\"XFlux\",VLOOKUP($Q$6,'XF CF'!$A$15:$G$20,2,FALSE),IF($Q$5=\"MIX\",VLOOKUP($Q$6,'75 CF'!A10:G14,2,FALSE),IF($Q$5=\"KMM\",VLOOKUP($Q$6,'79 CF'!$A$11:$G$14,2,FALSE)))))))","v":5.6635466675472326E-2},null,"NM A",null,null,{"$f":"IF($V$5=\"Kool Mu\",VLOOKUP($V$6,#REF!,2,FALSE),IF($V$5=\"MPP\",VLOOKUP($V$6,#REF!,2,FALSE),IF($V$5=\"High Flux\",VLOOKUP($V$6,#REF!,2,FALSE),IF($V$5=\"XFlux\",VLOOKUP($V$6,#REF!,2,FALSE)))))","v":false}]
[null,null,null,null,null,null,null,null,null,null,null,null,null,"NM B",null,null,{"$f":"IF($Q$5=\"Kool Mu\",VLOOKUP($Q$6,'Kool Mu CF Constants'!$A$16:$G$22,3,FALSE),IF($Q$5=\"MPP\",VLOOKUP($Q$6,'MPP CF'!$A$14:$G$23,3,FALSE),IF($Q$5=\"High Flux\",VLOOKUP($Q$6,'HF CF'!$A$11:$G$17,3,FALSE),IF($Q$5=\"XFlux\",VLOOKUP($Q$6,'XF CF'!$A$15:$G$20,3,FALSE),IF($Q$5=\"MIX\",VLOOKUP($Q$6,'75 CF'!A10:G14,3,FALSE),IF($Q$5=\"KMM\",VLOOKUP($Q$6,'79 CF'!$A$11:$G$14,3,FALSE)))))))","v":2.0912677398309869E-2},null,"NM B",null,null,{"$f":"IF($V$5=\"Kool Mu\",VLOOKUP($V$6,#REF!,3,FALSE),IF($V$5=\"MPP\",VLOOKUP($V$6,#REF!,3,FALSE),IF($V$5=\"High Flux\",VLOOKUP($V$6,#REF!,3,FALSE),IF($V$5=\"XFlux\",VLOOKUP($V$6,#REF!,3,FALSE)))))","v":false}]
[null,null,null,null,null,null,null,null,null,null,null,null,null,"NM C",null,null,{"$f":"IF($Q$5=\"Kool Mu\",VLOOKUP($Q$6,'Kool Mu CF Constants'!$A$16:$G$22,4,FALSE),IF($Q$5=\"MPP\",VLOOKUP($Q$6,'MPP CF'!$A$14:$G$23,4,FALSE),IF($Q$5=\"High Flux\",VLOOKUP($Q$6,'HF CF'!$A$11:$G$17,4,FALSE),IF($Q$5=\"XFlux\",VLOOKUP($Q$6,'XF CF'!$A$15:$G$20,4,FALSE),IF($Q$5=\"MIX\",VLOOKUP($Q$6,'75 CF'!A10:G14,4,FALSE),IF($Q$5=\"KMM\",VLOOKUP($Q$6,'79 CF'!$A$11:$G$14,4,FALSE)))))))","v":6.0753452838838444E-4},null,"NM C",null,null,{"$f":"IF($V$5=\"Kool Mu\",VLOOKUP($V$6,#REF!,4,FALSE),IF($V$5=\"MPP\",VLOOKUP($V$6,#REF!,4,FALSE),IF($V$5=\"High Flux\",VLOOKUP($V$6,#REF!,4,FALSE),IF($V$5=\"XFlux\",VLOOKUP($V$6,#REF!,4,FALSE)))))","v":false}]
[null,null,null,null,null,null,null,null,null,null,null,null,null,"NM D",null,null,{"$f":"IF($Q$5=\"Kool Mu\",VLOOKUP($Q$6,'Kool Mu CF Constants'!$A$16:$G$22,5,FALSE),IF($Q$5=\"MPP\",VLOOKUP($Q$6,'MPP CF'!$A$14:$G$23,5,FALSE),IF($Q$5=\"High Flux\",VLOOKUP($Q$6,'HF CF'!$A$11:$G$17,5,FALSE),IF($Q$5=\"XFlux\",VLOOKUP($Q$6,'XF CF'!$A$15:$G$20,5,FALSE),IF($Q$5=\"MIX\",VLOOKUP($Q$6,'75 CF'!A10:G14,5,FALSE),IF($Q$5=\"KMM\",VLOOKUP($Q$6,'79 CF'!$A$11:$G$14,5,FALSE)))))))","v":0.14373112625852619},null,"NM D",null,null,{"$f":"IF($V$5=\"Kool Mu\",VLOOKUP($V$6,#REF!,5,FALSE),IF($V$5=\"MPP\",VLOOKUP($V$6,#REF!,5,FALSE),IF($V$5=\"High Flux\",VLOOKUP($V$6,#REF!,5,FALSE),IF($V$5=\"XFlux\",VLOOKUP($V$6,#REF!,5,FALSE)))))","v":false}]
[null,null,null,null,null,null,null,null,null,null,null,null,null,"NM E",null,null,{"$f":"IF($Q$5=\"Kool Mu\",VLOOKUP($Q$6,'Kool Mu CF Constants'!$A$16:$G$22,6,FALSE),IF($Q$5=\"MPP\",VLOOKUP($Q$6,'MPP CF'!$A$14:$G$23,6,FALSE),IF($Q$5=\"High Flux\",VLOOKUP($Q$6,'HF CF'!$A$11:$G$17,6,FALSE),IF($Q$5=\"XFlux\",VLOOKUP($Q$6,'XF CF'!$A$15:$G$20,6,FALSE),IF($Q$5=\"MIX\",VLOOKUP($Q$6,'75 CF'!A10:G14,6,FALSE),IF($Q$5=\"KMM\",VLOOKUP($Q$6,'79 CF'!$A$11:$G$14,6,FALSE)))))))","v":5.0128553954388718E-4},null,"NM E",null,null,{"$f":"IF($V$5=\"Kool Mu\",VLOOKUP($V$6,#REF!,6,FALSE),IF($V$5=\"MPP\",VLOOKUP($V$6,#REF!,6,FALSE),IF($V$5=\"High Flux\",VLOOKUP($V$6,#REF!,6,FALSE),IF($V$5=\"XFlux\",VLOOKUP($V$6,#REF!,6,FALSE)))))","v":false}]
[null,null,null,null,null,null,null,null,null,null,null,null,null,"NM X",null,null,{"$f":"IF($Q$5=\"Kool Mu\",VLOOKUP($Q$6,'Kool Mu CF Constants'!$A$16:$G$22,7,FALSE),IF($Q$5=\"MPP\",VLOOKUP($Q$6,'MPP CF'!$A$14:$G$23,7,FALSE),IF($Q$5=\"High Flux\",VLOOKUP($Q$6,'HF CF'!$A$11:$G$17,7,FALSE),IF($Q$5=\"XFlux\",VLOOKUP($Q$6,'XF CF'!$A$15:$G$20,7,FALSE),IF($Q$5=\"MIX\",VLOOKUP($Q$6,'75 CF'!A11:G15,7,FALSE),IF($Q$5=\"KMM\",VLOOKUP($Q$6,'79 CF'!$A$11:$G$14,7,FALSE)))))))","v":1.8501842441207665},null,"NM X",null,null,{"$f":"IF($V$5=\"Kool Mu\",VLOOKUP($V$6,#REF!,7,FALSE),IF($V$5=\"MPP\",VLOOKUP($V$6,#REF!,7,FALSE),IF($V$5=\"High Flux\",VLOOKUP($V$6,#REF!,7,FALSE),IF($V$5=\"XFlux\",VLOOKUP($V$6,#REF!,7,FALSE)))))","v":false}]
[null,null,null,null,null,null,null,null,null,null,null,"Index",{"$f":"R5*10000+Q6*10+F7","v":60192},"CL A",null,null,{"$f":"VLOOKUP(M108,'CL Sum'!C1:I156,4,0)","v":468.97800000000001},null,"CL A",null,null,{"$f":"IF($V$5=\"Kool Mu\",VLOOKUP($V$6,#REF!,2,FALSE),IF($V$5=\"MPP\",VLOOKUP($V$6,#REF!,2,FALSE),IF($V$5=\"High Flux\",VLOOKUP($V$6,#REF!,2,FALSE),IF($V$5=\"XFlux\",VLOOKUP($V$6,#REF!,2,FALSE)))))","v":false}]
[null,null,null,null,null,null,null,null,null,null,null,null,null,"CL B",null,null,{"$f":"VLOOKUP(M108,'CL Sum'!C2:I157,5,0)","v":2.141},null,"CL B",null,null,{"$f":"IF($V$5=\"Kool Mu\",VLOOKUP($V$6,#REF!,3,FALSE),IF($V$5=\"MPP\",VLOOKUP($V$6,#REF!,3,FALSE),IF($V$5=\"High Flux\",VLOOKUP($V$6,#REF!,3,FALSE),IF($V$5=\"XFlux\",VLOOKUP($V$6,#REF!,3,FALSE)))))","v":false}]
[null,null,null,null,null,null,null,null,null,null,null,null,null,"CL C",null,null,{"$f":"VLOOKUP(M108,'CL Sum'!C3:I158,6,0)","v":1.0669999999999999},null,"CL C",null,null,{"$f":"IF($V$5=\"Kool Mu\",VLOOKUP($V$6,#REF!,4,FALSE),IF($V$5=\"MPP\",VLOOKUP($V$6,#REF!,4,FALSE),IF($V$5=\"High Flux\",VLOOKUP($V$6,#REF!,4,FALSE),IF($V$5=\"XFlux\",VLOOKUP($V$6,#REF!,4,FALSE)))))","v":false}]
[null,null,null,null,null,null,null,null,null,null,null,null,null,"DC + AC Ripple Drive",null,null,{"$f":"1.26*($E$16*Q49/Q45)","v":241.88888888888886},null,"DC + AC Ripple Drive",null,null,{"$f":"$E$16*V49/V45","v":23.13084112149533}]
[null,null,null,null,null,null,null,null,null,null,null,null,null,"DC-AC Ripple Drive",null,null,{"$f":"1.26*($E$17*Q49/Q45)","v":80.629629629629619},null,"DC-AC Ripple Drive",null,null,{"$f":"$E$17*V49/V45","v":7.7102803738317762}]
[null,null,null,null,null,null,null,null,null,null,null,null,null,"DC or low f AC RMS Drive Init",null,null,{"$f":"IF($E$18=0,1.26*($E19*Q47/Q45),1.26*($E$18*Q47/Q45))","v":144.66666666666666},null,"DC or low f AC RMS Drive Init",null,null,{"$f":"$E$18*V47/V45","v":15.420560747663552}]
[null,null,null,null,null,null,null,null,null,null,null,null,null,"If low f AC Drive",null,null,{"$f":"1.26*($E$19*Q49/Q45)","v":308.68466113231318},null,"If low f AC Drive",null,null,{"$f":"$E$19*V49/V45","v":29.518246522575769}]
[null,null,null,null,null,null,null,null,null,null,null,null,null,"DC or low f AC RMS Drive 2nd",null,null,{"$f":"IF($E$18=0,1.26*($E$19*Q49/Q45),1.26*($E$18*Q49/Q45))","v":161.25925925925924},null,"DC or low f AC RMS Drive 2nd",null,null,{"$f":"$E$18*V49/V45","v":15.420560747663552}]
[null,null,null,null,null,null,null,null,null,null,null,null,null,"Specified Current Drive",null,null,{"$f":"1.26*($E$20*Q49/Q45)","v":0},null,"Specified Current Drive",null,null,{"$f":"$E$20*V49/V45","v":0}]
[]
[]
[]
[null,null,null,null,null,null,null,null,null,null,null,null,null,"Finished OD(mm)",null,null,{"$f":"Q65+Q71*2*Q23*1.1","v":113.77273465723678}]
[null,null,null,null,null,null,null,null,null,null,null,null,null,"Finished HT(mm)",null,null,{"$f":"Q67+Q71*2*Q23*1.1","v":28.672734657236781}]

{"sheet":"Curve","index":5,"n_rows":6,"n_cols":2,"rows_kept":6,"cut":false,"hidden":true,"merged":[]}
[]
[]
[1,1]
[2,2]
[3,3]
[4,4]

{"sheet":"Sheet2","index":6,"n_rows":0,"n_cols":0,"rows_kept":0,"cut":false,"hidden":true,"merged":[]}

{"sheet":"Welcome","index":7,"n_rows":0,"n_cols":0,"rows_kept":0,"cut":false,"hidden":false,"merged":[]}

{"sheet":"Sheet1","index":8,"n_rows":0,"n_cols":0,"rows_kept":0,"cut":false,"hidden":true,"merged":[]}

{"sheet":"MPP CF","index":9,"n_rows":44,"n_cols":7,"rows_kept":44,"cut":false,"hidden":true,"merged":[]}
["MPP"]
["DC Bias","a","b","c","d","e"]
[14,0.01,1.346107191368058E-9,2.5958300407455317]
[26,0.01,1.0896677651864416E-8,2.5051162652390424]
[60,0.01,1.1652679425458997E-7,2.4359649995511266]
[125,0.01,1.1730346315832069E-6,2.2534569616579643]
[147,0.01,9.1175110350001665E-7,2.4297727699154854]
[160,0.01,9.5245807478633885E-7,2.4772252516933335]
[173,0.01,8.078101470681603E-7,2.5633835280555033]
[200,0.01,1.4962206702048759E-6,2.4772252516933335]
[300,0.01,1.116583359046946E-5,2.2155686267971104]
[550,0.01,5.5971197391739167E-4,1.7095112913514543]
["Norm Mag","a","b","c","d","e","x"]
[14,7.8789633529217529E-2,1.8038580600375276E-2,5.6503874744183154E-4,0.13415703563839393,5.3976233132453123E-4,2.0447306507165028]
[26,9.5806138220370193E-2,1.683038482486026E-2,7.1516235216415838E-4,9.6799416961851931E-2,6.8317205126208443E-4,2.0241399459806884]
[60,8.6355569666450888E-2,1.6858532346559492E-2,8.8906225080243268E-4,6.3952208725935364E-2,8.4469509400909696E-4,1.7808549099245139]
[125,2.7321601359666638E-2,1.5577249576551161E-2,1.1482904611510229E-3,5.5120844575791431E-2,1.0034917727922551E-3,1.2357706903038495]
[147,1.8815341804153125E-2,1.4623191804175529E-2,1.100884141335512E-3,4.4385220057987416E-2,1.0089291072843192E-3,1.1247971582512615]
[160,1.0515057600532769E-2,1.9900254023132845E-2,4.3974321694162414E-5,7.9940092089647672E-3,1.3817036371240705E-4,1.1283998061632721]
[173,1.3574982674555302E-2,1.3889103916881687E-2,1.203435244996155E-3,3.8160386288033851E-2,1.1380656403518782E-3,1.0431821301426365]
[200,7.6310317439755738E-3,1.3757199222677463E-2,1.2180801814203285E-3,3.2632769291910467E-2,1.1604583894915959E-3,0.9657203737051695]
[300,1.4813723644619605E-2,4.1549488754473014E-2,1.0286342478609649E-3,4.0153558170413835E-2,1.1822780740078716E-3,1.1978244268589042]
[550,0,7.1607303714748327E-2,2.1905722162067419E-4,9.482018089819659E-2,2.0385243293409971E-3,1.070325672492956]
[null,"Core Loss","a","b","c"]
[">10KHz",14,21.06,1.0740000000000001,1.38]
[">10KHz",26,109.17,2,1.37]
[">10KHz",60,31.32,1.585,1.37]
[">10KHz",125,87.07,2.222,1.56]
[">10KHz",147,87.07,2.222,1.56]
[">10KHz",160,87.07,2.222,1.56]
[">10KHz",173,87.07,2.222,1.56]
[">10KHz",200,115.52,2.3220000000000001,1.59]
[">10KHz",300,115.52,2.3220000000000001,1.59]
[">10KHz",550,96.89,1.9990000000000001,1.54]
["<10KHz",14,64.02,1.0740000000000001,1.1100000000000001]
["<10KHz",26,361.62,2,1.08]
["<10KHz",60,80.12,1.585,1.04]
["<10KHz",125,254.26,2.222,1.17]
["<10KHz",147,254.26,2.222,1.17]
["<10KHz",160,254.26,2.222,1.17]
["<10KHz",173,254.26,2.222,1.17]
["<10KHz",200,320.32,2.3220000000000001,1.19]
["<10KHz",300,320.32,2.3220000000000001,1.19]
["<10KHz",550,303.43,1.9990000000000001,1.0900000000000001]

{"sheet":"HF CF","index":10,"n_rows":32,"n_cols":7,"rows_kept":32,"cut":false,"hidden":true,"merged":[]}
["High Flux"]
["DC Bias","a","b","c","d","e"]
[14,0.01,3.389412378818108E-8,1.9229137421004299]
[26,0.01,4.2046566124713119E-9,2.4259231172557656]
[40,0.01,1.8410663125389004E-8,2.4094208396532091]
[60,0.01,6.4125732541903577E-8,2.2905047710416975]
[125,0.01,1.402709576156965E-7,2.4653666630338531]
[147,0.01,1.2070273621681354E-6,2.1308343922747586]
[160,0.01,1.7037297726250924E-6,2.0944335903463975]
["Norm Mag","a","b","c","d","e","x"]
[14,0,1.8920552038554365E-2,4.1308121837898193E-4,0.15016602668741072,2.9814217510497337E-4,1.7370986624858877]
[26,8.5307454492533658E-2,2.2464001770710312E-2,5.733006274202644E-4,0.10261396087443918,4.159094522254517E-4,2.0958714611640876]
[40,0.10197030813923198,1.9363784094411449E-2,8.1769200795861832E-4,9.3579222244911803E-2,6.2200850193237323E-4,1.933433378326177]
[60,8.6488871416781438E-2,2.0292940719338948E-2,8.9742002525385446E-4,8.2938678165974694E-2,6.0337393422033665E-4,1.7662413417220064]
[125,8.4778170887187865E-2,1.7992480584723684E-2,4.7778837069591304E-5,9.0550272520006636E-3,4.7962734431181668E-5,1.4837415097483424]
[147,3.66316023395492E-2,1.8345746212541772E-2,1.3280949311731459E-3,5.9380157483966745E-2,8.3882653398177241E-4,1.2572956454522386]
[160,2.8955912449814793E-2,1.7958576388993036E-2,1.3887987122177107E-3,5.8439319317689205E-2,8.5906384385667841E-4,1.1913677604459558]
[null,"Core Loss","a","b","c"]
[">25KHz",14,181.14,1.3859999999999999,1.21]
[">25KHz",26,532.54999999999995,2.17,1.35]
[">25KHz",40,1707.09,2.2799999999999998,1.1399999999999999]
[">25KHz",60,47.51,1.585,1.43]
[">25KHz",125,47.51,1.585,1.43]
[">25KHz",147,203.61,2.1629999999999998,1.52]
[">25KHz",160,203.61,2.1629999999999998,1.52]
["<25KHz",14,181.14,1.3859999999999999,1.21]
["<25KHz",26,1550.54,2.17,1.05]
["<25KHz",40,2021.58,2.2799999999999998,1.05]
["<25KHz",60,151.44,1.585,1.0900000000000001]
["<25KHz",125,151.44,1.585,1.0900000000000001]
["<25KHz",147,883.51,2.1629999999999998,1.52]
["<25KHz",160,883.51,2.1629999999999998,1.52]

{"sheet":"XF CF","index":11,"n_rows":31,"n_cols":8,"rows_kept":31,"cut":false,"hidden":true,"merged":[[14,7,19,7],[6,6,7,6],[8,4,11,4],[2,4,7,4]]}
["Xflux"]
["DC Bias","a","b","c","d","e"]
[19,0.01,2.9971583853423301E-9,2.3390399481078119,"Toroid"]
[26,0.01,6.7837081364699409E-8,1.9664261960719924]
[40,0.01,5.9375883103932353E-8,2.187537296889237]
[60,0.01,2.7020686306515555E-8,2.5110908419100424]
[75,0.01,1.2240173311549056E-7,2.3058416974432552]
[90,0.01,4.9088514647456561E-7,2.1498648695927711]
[26,0.01,5.5602059150688418E-8,2.0538881285989601,"Shape"]
[40,0.01,3.2062617485860259E-7,1.9317398839473807]
[60,0.01,3.5695999949744094E-7,2.0470015054298565]
[90]
[]
["Norm Mag","a","b","c","d","e","x"]
[19,7.5809874036883357E-2,1.8483382678071023E-2,4.9823707532655186E-4,0.14582668481658942,3.0897279340454765E-4,1.6840210735477652,"Toroid"]
[26,3.9635063134097155E-2,2.0678580221256321E-2,5.6789124679691065E-4,0.11720034646964067,3.8798022282421341E-4,1.8115517301030744]
[40,8.7109575532155786E-2,2.0052123988522925E-2,7.9489553743198303E-4,9.6943207277137136E-2,5.9190557225593057E-4,1.8808458802357726]
[60,0.12111291102936329,1.353135757882599E-2,0,9.6263749799308067E-3,1.5258789062500001E-6,1.8813324699393947]
[75,9.9009559643706765E-2,1.3573979810583517E-2,1.7498506854894851E-4,1.8165040641071752E-2,1.2926616687722147E-4,1.6619366881949831]
[90,6.2688678569298578E-2,1.7982184448450907E-2,1.032259828926555E-3,6.6393572260550246E-2,7.5515681713571726E-4,1.5224581764440694]
["Core Loss",null,"a","b","c"]
[">25kHz",26,761.36,1.9770000000000001,1.21]
["<25kHz",26,1187.96,1.9770000000000001,1.05]
[">9kHz",40,804.88,1.9339999999999999,1.1399999999999999]
["<9kHz",40,1274.93,1.9339999999999999,1.06]
[">10kHz",60,454.56,1.909,1.19]
["<10kHz",60,670.26,1.909,1.06]
[">9kHz",75,566.54,2.0179999999999998,1.17]
["<9kHz",75,862.34,2.0179999999999998,1.02]
[">9kHz",90,566.54,2.0179999999999998,1.17]
["<9kHz",90,862.34,2.0179999999999998,1.02]

{"sheet":"79 CF","index":12,"n_rows":22,"n_cols":7,"rows_kept":22,"cut":false,"hidden":true,"merged":[]}
[79]
["DC Bias","a","b","c"]
[19,0.01,3.1356414722723549E-8,2.1107453632639701]
[26,0.01,3.4443808411203399E-8,2.2053376776478877]
[40,0.01,5.9192491666018686E-7,1.8552832463136577]
[60,0.01,5.917159763313609E-7,2]
[]
[]
[]
["Norm Mag","a","b","c","d","e","x"]
[19,5.6635466675472326E-2,2.0912677398309869E-2,6.0753452838838444E-4,0.14373112625852619,5.0128553954388718E-4,1.8501842441207665]
[26,7.763862470088928E-2,2.0805359739736407E-2,6.8949207949335785E-4,0.10988997593231298,5.8704894704119596E-4,2.009291538200519]
[40,6.1007341144224479E-2,2.2790922847961394E-2,7.2670359565880612E-4,9.5004277554452413E-2,5.9788428294663316E-4,1.8703220450187057]
[60,7.3349098158606116E-2,1.8732797755067778E-2,8.5021041896987779E-4,7.4120553714031159E-2,7.0069048153653701E-4,1.7226520076018488]
[]
[]
[]
["Core Loss","a","b","c"]
[]
[26,271,2.0310000000000001,1.44]
[40,309,2.14,1.46]
[60,251.4,2.0659999999999998,1.41]

{"sheet":"75 CF","index":13,"n_rows":22,"n_cols":7,"rows_kept":22,"cut":false,"hidden":true,"merged":[]}
[75]
["DC Bias","a","b","c"]
[]
[26,0.01,5.8221723159236905E-7,1.6585866683192652]
[40,0.01,1.3584193306853901E-6,1.6508404646967436]
[60,0.01,1.1010311917135724E-6,1.8189496240181691]
[]
[]
[]
["Norm Mag","a","b","c","d","e","x"]
[]
[26,1.9346930086928525E-2,1.8205996842823109E-2,4.0735600670612453E-4,9.1619897460319913E-2,2.9517437046180033E-4,1.7484931463382609]
[40,3.6273248903558486E-2,2.1484087348341611E-2,6.9718005523152046E-4,0.10289963701426555,5.1752929170804788E-4,1.7184132380942143]
[60,6.0473087765755863E-2,2.0810667194590019E-2,8.5824746706774139E-4,8.4272343109202244E-2,6.3522078518224781E-4,1.6863608710277707]
[]
[]
[]
["Core Loss","a","b","c"]
[]
[26,271,2.0310000000000001,1.44]
[40,309,2.14,1.46]
[60,251.4,2.0659999999999998,1.41]

{"sheet":"PN_75","index":14,"n_rows":36,"n_cols":9,"rows_kept":36,"cut":false,"hidden":true,"merged":[]}
[null,"Size",null,null,null,null,"60µ","40µ","26µ"]
[null,"140",null,null,null,null,0,0,0]
[null,"150",null,null,null,null,0,0,0]
[null,"180",null,null,null,null,0,0,0]
[null,20,null,null,null,null,0,0,0]
[null,240,null,null,null,null,0,0,0]
[null,270,null,null,null,null,0,0,0]
[null,"410",null,null,null,null,0,0,0]
[null,30,null,null,null,null,0,0,0]
[null,280,null,null,null,null,0,0,0]
[null,290,null,null,null,null,0,0,0]
[null,40,null,null,null,null,0,0,0]
[null,"130",null,null,null,null,0,0,0]
[null,50,null,null,null,null,0,0,0]
[null,120,null,null,null,null,0,0,0]
[null,"380",null,null,null,null,0,0,0]
[null,206,null,null,null,null,0,0,0]
[null,310,null,null,null,null,75059,75316,75312]
[null,"350",null,null,null,null,75351,75356,75352]
[null,930,null,null,null,null,75894,75936,75932]
[null,585,null,null,null,null,75586,75591,75587]
[null,548,null,null,null,null,75071,75555,75550]
[null,324,null,null,null,null,75076,75330,75326]
[null,254,null,null,null,null,75083,75260,75256]
[null,"089",null,null,null,null,75090,75095,75091]
[null,"438",null,null,null,null,75439,75431,75440]
[null,"715",null,null,null,null,75716,75721,75717]
[null,"195",null,null,null,null,75192,75189,75191]
[null,"109",null,null,null,null,75110,75212,75111]
[null,620,null,null,null,null,75617,75616,75615]
[null,"740",null,null,null,null,75737,75736,75735]
[null,"866",null,null,null,null,75867,75872,75868]
[null,"906",null,null,null,null,75907,75912,75908]
[null,"102",null,null,null,null,75099,75100,75102]
[null,"337",null,null,null,null,75339,75338,75337]
[null,"165",null,null,null,null,"-","-","-"]

{"sheet":"LI_75","index":15,"n_rows":36,"n_cols":10,"rows_kept":36,"cut":false,"hidden":true,"merged":[]}
["Catalog page","Size Code","Max","125u","90u","75u","60u","40u","26u","LI^2 max %ui=0.5min"]
[1,"140",{"$f":"MAX(G2:I2)","v":0},0,0,0,0,0,0]
[2,"150",{"$f":"MAX(G3:I3)","v":0},0,0,0,0,0,0]
[3,"180",0,0,0,0,0,0,0]
[4,"020",0,0,0,0,0,0,0]
[5,"240",0,0,0,0,0,0,0]
[6,"270",0,0,0,0,0,0,0]
[8,"030",0,0,0,0,0,0,0]
[7,"410",0,0,0,0,0,0,0]
[9,"280",0,0,0,0,0,0,0]
[10,"290",0,0,0,0,0,0,0]
[11,"040",0,0,0,0,0,0,0]
[12,"130",0,0,0,0,0,0,0]
[13,"050",0,0,0,0,0,0,0]
[15,"380",0,0,0,0,0,0,0]
[14,"120",0,0,0,0,0,0,0]
[16,"206",0,0,0,0,0,0,0]
[17,"310",1.6080061703665538,0,0,0,1.6080061703665538,1.2477132818107286,0.88917787111962077,1.868963377019327]
[18,"350",2.1169897339240671,0,0,0,2.1169897339240671,1.630272832974089,1.1498409906885965,2.4101991294831873]
[19,"930",3.4613785828408381,0,0,0,3.4613785828408381,2.6496777964510749,1.8426206380805434,4.0227315180640657]
[21,"585",7.9657569981173451,0,0,0,7.9657569981173451,7.1733215068633438,5.4879531052236086,7.9657569981173451]
[20,"548",8.0937196421170619,0,0,0,8.0937196421170619,6.8817810271426234,5.3751885152760019,8.0937196421170619]
[22,"324",10.522183443994866,0,0,0,10.522183443994866,9.1620711839897027,6.9512856882385483,10.522183443994866]
[23,"254",19.813000758045085,0,0,0,19.813000758045085,17.860957107848719,13.740267055481723,19.813000758045085]
[25,"089",34.812356584819014,0,0,0,31.099735521523165,34.812356584819014,28.1583278291344,34.812356584819014]
[24,"438",35.464864158516562,0,0,0,35.464864158516562,30.949564792239336,23.642585196016086,35.464864158516562]
[26,"715",41.774013197563072,0,0,0,31.628491749060093,41.774013197563072,35.227015614223859,41.774013197563072]
[27,"195",51.083862661524044,0,0,0,51.083862661524044,45.108629983194319,34.507670239464517,51.083862661524044]
[28,"109",64.775816926406293,0,0,0,41.004559743280623,64.775816926406293,58.429020579687226,64.775816926406293]
[29,"620",124.93988683877377,0,0,0,104.78173935685857,124.93988683877377,102.58758301034142,124.93988683877377]
[31,"866",151.3024058933656,0,0,0,72.359161860713854,119.09868462303447,151.3024058933656,151.3024058933656]
[32,"906",187.0394394377094,0,0,0,90.902898676156369,151.61546357708173,187.0394394377094,187.0394394377094]
[30,"740",344.68546125962405,0,0,0,184.65651225479701,306.1845027814615,344.68546125962405,344.68546125962405]
[33,"102",416.7383511948421,0,0,0,175.24044244001399,290.57143493353919,416.7383511948421,416.7383511948421]
[34,"337",1196.5620563498621,0,0,0,443.45128977813357,732.97298902154034,1196.5620563498621,1196.5620563498621]
[35,"165",2219.3476038301728,0,0,0,0,1354.516592075167,2219.3476038301728,2219.3476038301728]

{"sheet":"Kool Mu CF Constants","index":16,"n_rows":37,"n_cols":7,"rows_kept":37,"cut":false,"hidden":true,"merged":[[2,4,8,4],[10,4,13,4]]}
["Kool Mu"]
["DC Bias","a","b","c"]
[14,0.01,5.2177659209894896E-8,1.9898351342710845,"Toroid"]
[26,0.01,5.2662138758857603E-7,1.8189496240181691]
[40,0.01,2.1772688446718944E-6,1.7039155851053662]
[60,0.01,3.476996287679459E-6,1.7488772261981522]
[75,0.01,8.6979849715853762E-6,1.6644005005428471]
[90,0.01,1.8902818016453982E-5,1.5578835941363762]
[125,0.01,4.5430521332308212E-5,1.4622750035237537]
[]
[26,0.01,6.6151098360610117E-7,1.8735839051042336,"Shape"]
[40,0.01,3.6269050371917716E-6,1.6562980913815812]
[60,0.01,1.1080805358129648E-5,1.5548421773629291]
[90,0.01,1.1148740592362017E-5,1.743920319193937]
["Norm Mag","a","b","c","d","e","x"]
[14,2.391632556705419E-2,1.8503287719661265E-2,5.2072103046410761E-4,0.15043852917651454,4.8603341626523683E-4,1.8389872274827392]
[26,4.4438068166029333E-2,2.0444196710216529E-2,6.8557363974725298E-4,0.11420913034423397,6.5998520252827202E-4,1.8788999345714985]
[40,5.2194666204721213E-2,2.1084820557725981E-2,7.7038126367865898E-4,9.4891457692355061E-2,7.4567073508110886E-4,1.81244189141217]
[60,5.3477022472399348E-2,2.1134697557881478E-2,8.3161563160939506E-4,7.7388108570799058E-2,7.994452395687202E-4,1.701430649216743]
[75,4.6219773283920386E-2,2.2784053635025857E-2,7.89953146735557E-4,6.9200287647481498E-2,7.9141315102360652E-4,1.6280383541377526]
[90,4.2964071804485526E-2,2.5820394589569085E-2,7.872167138177989E-4,6.8310659632635606E-2,7.8028662014273289E-4,1.5960228556079028]
[125,1.4503632530433267E-2,2.3992846262027637E-2,1.1059920137720259E-3,7.9971027722595109E-2,1.069113810386226E-3,1.2907211757785777]
[null,"Core Loss","a","b","c"]
[">10KHz",14,21.49,1,1.33]
[">10KHz",26,45.48,1.774,1.46]
[">10KHz",40,45.48,1.774,1.46]
[">9KHz",60,62.65,1.7809999999999999,1.36]
[">10KHz",75,146.81,2.0219999999999998,1.33]
[">10KHz",90,146.81,2.0219999999999998,1.33]
[">10KHz",125,71.930000000000007,1.9279999999999999,1.47]
["<10KHz",14,40.18,1,1.22]
["<10KHz",26,170.17,1.774,1.03]
["<10KHz",40,170.17,1.774,1.03]
["<9KHz",60,136.93,1.7809999999999999,1.1200000000000001]
["<10KHz",75,338.51,2.0219999999999998,1.05]
["<10KHz",90,338.51,2.0219999999999998,1.05]
["<10KHz",125,228.46,1.9279999999999999,1.05]

{"sheet":"All Material CL CF","index":17,"n_rows":0,"n_cols":0,"rows_kept":0,"cut":false,"hidden":true,"merged":[]}

{"sheet":"E Core Design","index":18,"n_rows":131,"n_cols":46,"rows_kept":131,"cut":false,"hidden":true,"merged":[[25,41,25,42],[2,1,2,3],[2,13,2,15],[3,1,3,3],[3,13,3,15],[0,1,0,3],[0,13,0,15],[1,1,1,3],[1,13,1,15],[0,6,0,8],[0,9,0,11],[8,1,8,3],[8,13,8,15],[9,1,9,3],[9,13,9,15],[6,1,6,3],[6,13,6,15],[7,1,7,3],[7,13,7,15],[4,1,4,3],[4,13,4,15],[5,1,5,3],[1,33,1,35],[1,37,1,39],[11,1,11,3],[20,1,20,3],[10,1,10,3],[33,1,33,3],[33,13,33,15],[25,13,25,15],[26,13,26,15],[23,13,23,15],[24,13,24,15],[21,13,21,15],[22,13,22,15],[19,13,19,15],[20,13,20,15],[18,13,18,15],[34,1,34,3],[34,13,34,15],[31,1,31,3],[31,13,31,15],[32,1,32,3],[32,13,32,15],[29,1,29,3],[29,13,29,15],[30,1,30,3],[30,13,30,15],[41,13,41,15],[43,13,43,15],[39,13,39,15],[40,13,40,15],[37,13,37,15],[38,13,38,15],[35,1,35,3],[35,13,35,15],[36,13,36,15],[53,13,53,15],[54,13,54,15],[51,13,51,15],[52,13,52,15],[49,13,49,15],[50,13,50,15],[47,13,47,15],[48,13,48,15],[44,13,44,15],[46,13,46,15],[63,13,63,15],[64,13,64,15],[61,13,61,15],[62,13,62,15],[59,13,59,15],[60,13,60,15],[57,13,57,15],[58,13,58,15],[55,13,55,15],[56,13,56,15],[75,13,75,15],[76,13,76,15],[73,13,73,15],[74,13,74,15],[71,13,71,15],[72,13,72,15],[69,13,69,15],[70,13,70,15],[65,13,65,15],[66,13,66,15],[67,13,67,15],[68,13,68,15],[85,13,85,15],[86,13,86,15],[83,13,83,15],[84,13,84,15],[81,13,81,15],[82,13,82,15],[79,13,79,15],[80,13,80,15],[77,13,77,15],[78,13,78,15],[95,13,95,15],[96,13,96,15],[93,13,93,15],[94,13,94,15],[91,13,91,15],[92,13,92,15],[89,13,89,15],[90,13,90,15],[87,13,87,15],[88,13,88,15],[105,13,105,15],[106,13,106,15],[103,13,103,15],[104,13,104,15],[101,13,101,15],[99,13,99,15],[100,13,100,15],[97,13,97,15],[98,13,98,15],[130,13,130,15],[42,13,42,15],[128,13,128,15],[129,13,129,15],[126,13,126,15],[127,13,127,15],[125,13,125,15],[123,13,123,15],[121,13,121,15],[122,13,122,15],[119,13,119,15],[120,13,120,15],[117,13,117,15],[118,13,118,15],[115,13,115,15],[116,13,116,15],[113,13,113,15],[114,13,114,15],[111,13,111,15],[112,13,112,15],[109,13,109,15],[110,13,110,15],[107,13,107,15],[108,13,108,15],[3,44,4,44],[6,44,7,44],[9,44,10,44],[2,37,2,39],[1,41,1,45],[22,44,23,44],[7,28,8,28],[7,31,8,31],[5,13,5,15],[16,13,16,15],[17,13,17,15],[14,13,14,15],[15,13,15,15],[12,13,12,15],[13,13,13,15],[10,13,10,15],[11,13,11,15],[3,41,4,42],[6,41,7,42],[9,41,10,42],[2,29,2,30],[1,29,1,30],[14,33,14,35],[7,30,8,30]]}
[null,"Select your Inductor Type",null,null,"DC w/ ripple",null,"Kool Mu E",null,null,"Xflux E",null,null,null,"Design #1"]
[null,"Inductor Requirements",null,null,null,null,null,"00K8044E026","00K130LE026",null,null,"00X8024E060",null,"Core Selection",null,null,null,null,null,null,null,null,null,null,null,null,null,null,null,"STEP 1",null,null,null,"STEP 2",null,null,null,"STEP 3",null,null,null,"STEP 4"]
[null,"Inductance Required (mH)",null,null,{"$f":"AE14","v":0},null,null,null,null,null,null,"00X8024E040",null,"Part Number",null,null,{"$f":"AM4","v":0},null,null,null,null,null,null,null,null,null,null,null,null,"Design Input",null,null,null,null,null,null,null,"Input a Part Number"]
[null,{"$f":"IF(E1=\"DC w/ ripple\",\"DC Amps\", IF(E1=\"Low AC w/ ripple\",\"AC RMS Amps\", IF(E1=\"pure AC no ripple\", \"AC RMS Amps\")))","v":"DC Amps"},null,null,{"$f":"AE6","v":0},null,null,null,null,null,null,null,null,"Number of Cores (Stack-per set)",null,null,{"$f":"AE17","v":1},null,null,null,null,null,null,null,null,null,null,null,"Material Selection",null,null,null,null,null,null,null,null,null,null,null,null,"Inductance at Full Load ",null,null,null,"mH"]
[null,{"$f":"IF(E1=\"Pure AC no ripple\", 0,\"RMS Ripple Current (Amps)\")","v":"RMS Ripple Current (Amps)"},null,null,{"$f":"E6/2/1.732","v":0},null,null,null,null,null,null,null,null,"Material",null,null,{"$f":"VLOOKUP(Q3,'E Core Detail'!$A$2:$D$100,4,FALSE)","v":{"$error":"#N/A"}},{"$f":"VLOOKUP(Q5,'CL Sum'!L2:M7,2,0)","v":{"$error":"#N/A"}}]
[null,{"$f":"IF(E1=\"Pure AC no ripple\",0,\"Pk-Pk Ripple Current (Amps)\")","v":"Pk-Pk Ripple Current (Amps)"},null,null,{"$f":"AE8","v":0},null,null,null,null,null,null,null,null,"Permeability",null,null,{"$f":"VLOOKUP(Q3,'E Core Detail'!$A$2:$C$100,3,FALSE)","v":{"$error":"#N/A"}},null,null,null,null,null,null,null,null,null,null,null,"DC Current ",null,null,"Amps"]
[null,"Specified Current",null,null,{"$f":"AE19","v":0},null,null,null,null,null,null,null,null,"AL (nH/T2) +/- 8%",null,null,{"$f":"VLOOKUP(Q3,'E Core Detail'!$A$2:$E$100,5,FALSE)*Q4","v":{"$error":"#N/A"}},null,0.01,{"$f":"IF(S7=0,\"No Value\",(1/($Q$105+$Q$106*(S7*$Q$54/$Q$49)^$Q$107))*0.01)","v":{"$error":"#N/A"}},null,null,null,null,null,null,null,null,null,null,null,null,null,null,null,null,null,null,null,null,null,"Inductance at No Load ",null,null,null,"mH"]
[null,{"$f":"IF(E1=\"Pure AC no ripple\", \"AC Frequency (kHz)\",\"PK-Pk Frequency (kHz)\")","v":"PK-Pk Frequency (kHz)"},null,null,{"$f":"AE11","v":0},{"$f":"IF(E8<9,0,IF(E8<10,1,IF(E8<25,2,3)))","v":0},null,null,null,null,null,null,null,"Specified Current Inductance MIN(mH)",null,null,{"$f":"IF($E$7=0,\"No Value\",(Q47*Q59)*Q54^2/10^6)","v":"No Value"},null,{"$f":"1/1.26*Q$49/Q$54","v":{"$error":"#N/A"}},{"$f":"IF(S8=0,\"No Value\",(1/($Q$105+$Q$106*(S8*$Q$54/$Q$49)^$Q$107))*0.01)","v":{"$error":"#N/A"}},null,null,null,null,null,null,null,null,"Ripple Current",null,null," Amps            (peak to peak)"]
[null,"Add. Lead Length/ end (mm)",null,null,null,null,null,null,null,null,null,null,null,"Max Current L MIN (mH)",null,null,{"$f":"(Q47*Q56)*Q54^2/10^6","v":{"$error":"#N/A"}},null,{"$f":"2/1.26*Q$49/Q$54","v":{"$error":"#N/A"}},{"$f":"IF(S9=0,\"No Value\",(1/($Q$105+$Q$106*(S9*$Q$54/$Q$49)^$Q$107))*0.01)","v":{"$error":"#N/A"}}]
[null,"Ambient Temperature(°C)",null,null,25,null,null,null,null,null,null,null,null,"Average Current Inductance MIN (mH)",null,null,{"$f":"(Q47*Q55)*Q54^2/10^6","v":{"$error":"#N/A"}},null,{"$f":"3/1.26*Q$49/Q$54","v":{"$error":"#N/A"}},{"$error":"#N/A"},null,null,null,null,null,null,null,null,null,null,null,null,null,null,null,null,null,null,null,null,null,"Specified Current Inductance",null,null,null,"mH"]
[null,"Type of Wire",null,null,"copper",null,null,null,null,null,null,null,null,"Min Current L MIN (mH)",null,null,{"$f":"(Q47*Q57)*Q54^2/10^6","v":{"$error":"#N/A"}},null,{"$f":"4/1.26*Q$49/Q$54","v":{"$error":"#N/A"}},{"$error":"#N/A"},null,null,null,null,null,null,null,null,"Frequency ",null,null,"KHz"]
[null,"Number of cores",null,null,{"$f":"AE17","v":1},null,null,null,null,null,null,null,null,"No Load Inductance (mH) +/- 8%",null,null,{"$f":"(Q7)*Q54^2/10^6","v":{"$error":"#N/A"}},null,{"$f":"5/1.26*Q$49/Q$54","v":{"$error":"#N/A"}},{"$error":"#N/A"}]
[null,null,null,null,null,null,null,null,null,null,null,null,null,"L +/- 8% if Max Current is low f AC",null,null,{"$f":"(Q7*Q58)*Q54^2/10^6","v":{"$error":"#N/A"}},null,{"$f":"6/1.26*Q$49/Q$54","v":{"$error":"#N/A"}},{"$error":"#N/A"},null,null,null,null,null,null,null,null,null,null,null,null,null,null,null,null,null,null,null,null,null,"Total Loss",null,null,null,"W"]
[null,null,null,null,null,null,null,null,null,null,null,null,null,"Core Loss (W)",null,null,{"$f":"(Q66*Q50)/1000","v":{"$error":"#N/A"}},null,{"$f":"7/1.26*Q$49/Q$54","v":{"$error":"#N/A"}},{"$error":"#N/A"},null,null,null,null,null,null,null,null,"Full Load L ",null,null,"mH"]
[null,null,null,null,null,null,null,null,null,null,null,null,null,"Copper Loss (W)",null,null,{"$f":"E4^2*Q42/1000+E5^2*Q43/1000","v":{"$error":"#N/A"}},null,{"$f":"8/1.26*Q$49/Q$54","v":{"$error":"#N/A"}},{"$error":"#N/A"},null,null,null,null,null,null,null,null,null,null,null,null,null,"Core A Dimension (mm)",null,null,null,null,null,null,null,"Temp Rise",null,null,null,"°C"]
[null,null,null,null,null,null,null,null,null,null,null,null,null,"Total Loss (W)",null,null,{"$f":"Q14+Q15","v":{"$error":"#N/A"}},null,{"$f":"9/1.26*Q$49/Q$54","v":{"$error":"#N/A"}},{"$error":"#N/A"}]
[null,null,null,null,null,null,null,null,null,null,null,null,null,"Approximate Fill Factor",null,null,{"$f":"Q36*Q54/Q48","v":{"$error":"#N/A"}},null,{"$f":"10/1.26*Q$49/Q$54","v":{"$error":"#N/A"}},{"$error":"#N/A"},null,null,null,null,null,null,null,null,"Stack Cores",null,1,null,null,null,null,null,null,null,null,null,null,"Number of Turns"]
[null,null,null,null,null,null,null,null,null,null,null,null,null,"DCR(mΩ, 20° C)",null,null,{"$f":"Q42","v":{"$error":"#N/A"}},null,{"$f":"20/1.26*Q$49/Q$54","v":{"$error":"#N/A"}},{"$error":"#N/A"}]
[null,null,null,null,null,null,null,null,null,null,null,null,null,"Temp Rise (C°)",null,null,{"$f":"(Q16*1000/Q44)^0.833","v":{"$error":"#N/A"}},null,{"$f":"30/1.26*Q$49/Q$54","v":{"$error":"#N/A"}},{"$error":"#N/A"},null,null,null,null,null,null,null,null,"Specified Current ",null,null,"Amps",null,null,null,null,null,null,null,null,null,"Wire Size ",null,null,null,"AWG"]
[null,null,null,null,null,null,null,null,null,null,null,null,null,"Operating Temperature (C°)",null,null,{"$f":"Q19+$E$10","v":{"$error":"#N/A"}},null,{"$f":"40/1.26*Q$49/Q$54","v":{"$error":"#N/A"}},{"$error":"#N/A"}]
[null,"Wire Size",null,null,null,null,null,null,null,null,null,null,null,"Number of Turns",null,null,{"$f":"Q54","v":{"$error":"#N/A"}},null,{"$f":"50/1.26*Q$49/Q$54","v":{"$error":"#N/A"}},{"$error":"#N/A"},null,null,null,null,null,null,null,null,"Temp Rise",null,null,"°C",null,null,null,null,null,null,null,null,null,"Winding Factor"]
[null,null,null,null,null,null,null,null,null,null,null,null,null,"Number of Layers Possible",null,null,{"$f":"ROUNDDOWN((((2*Q73)-(2*Q78))/Q81), 0)","v":{"$error":"#N/A"}},null,{"$f":"60/1.26*Q$49/Q$54","v":{"$error":"#N/A"}},{"$error":"#N/A"}]
[null,null,null,null,null,null,null,null,null,null,null,null,null,"Layers Needed",null,null,{"$f":"COUNTIF(Q83:Q91,\">0\")","v":0},null,{"$f":"70/1.26*Q$49/Q$54","v":{"$error":"#N/A"}},{"$error":"#N/A"},null,null,null,null,null,null,null,null,null,null,null,null,null,null,null,null,null,null,null,null,null,"DC Resistance of Winding ",null,null,null,"mΩ"]
[null,null,null,null,null,null,null,null,null,null,null,null,null,"Wire Length (mm)",null,null,{"$f":"(2*E9*Q32)+(Q97*Q32)","v":{"$error":"#N/A"}},null,{"$f":"80/1.26*Q$49/Q$54","v":{"$error":"#N/A"}},{"$error":"#N/A"}]
[null,null,null,null,null,null,null,null,null,null,null,null,null,"Wire Cost",null,null,null,null,{"$f":"90/1.26*Q$49/Q$54","v":{"$error":"#N/A"}},{"$error":"#N/A"}]
[null,null,null,null,null,null,null,null,null,null,null,null,null,"Per Core Cost",null,null,null,null,{"$f":"100/1.26*Q$49/Q$54","v":{"$error":"#N/A"}},{"$error":"#N/A"},null,null,null,null,null,null,null,null,"INSTRUCTIONS:",null,null,null,null,null,null,null,null,null,null,null,null,"Finished A",null,null,null,"mm"]
[null,null,null,null,null,null,null,null,null,null,null,null,null,"Total Cost",null,null,null,null,{"$f":"150/1.26*Q$49/Q$54","v":{"$error":"#N/A"}},{"$error":"#N/A"},null,null,null,null,null,null,null,null,"1.  Enter the input parameters in STEP 1."]
[null,null,null,null,null,null,null,null,null,null,null,null,null,null,null,null,null,null,{"$f":"200/1.26*Q$49/Q$54","v":{"$error":"#N/A"}},{"$error":"#N/A"},null,null,null,null,null,null,null,null,"  -  Full Load DC Current is the full load or peak bias current.  Enter zero if there is no bias current.",null,null,null,null,null,null,null,null,null,null,null,null,"Finished HT",null,null,null,"mm"]
[null,null,null,null,null,null,null,null,null,null,null,null,null,null,null,null,null,null,{"$f":"250/1.26*Q$49/Q$54","v":{"$error":"#N/A"}},{"$error":"#N/A"},null,null,null,null,null,null,null,null,"  -  Full Load L is the inductance required with  full load bias current plus ripple current."]
[null,"Design Criteria",null,null,null,null,null,null,null,null,null,null,null,"Winding Selection",null,null,null,null,{"$f":"300/1.26*Q$49/Q$54","v":{"$error":"#N/A"}},{"$error":"#N/A"},null,null,null,null,null,null,null,null,"  -  Specified Current is any RMS or bias current of interest.  ",null,null,null,null,null,null,null,null,null,null,null,null,"Adjust Turns"]
[null,"LI2 (Peak Current)",null,null,400,null,null,null,null,null,null,null,null,"Wire AWG",null,null,{"$f":"IF(AS32=0,E21,AS32)","v":0},null,{"$f":"400/1.26*Q$49/Q$54","v":{"$error":"#N/A"}},{"$error":"#N/A"}]
[null,{"$f":"IF(E1=\"DC w/ ripple\",\"DC + AC Ripple Current\",(IF(E1=\"Low AC w/ ripple\",\"low AC+AC Ripple Current\",IF(E1=\"Pure AC no ripple\",\"AC max current(Sine)\"))))","v":"DC + AC Ripple Current"},null,null,{"$f":"IF(E1=\"DC w/ ripple\",E4+(0.5*E6),IF(E1=\"Low AC w/ ripple\",E4*SQRT(2)+(0.5*E6),IF(E1=\"Pure AC no ripple\",E4*SQRT(2))))","v":0},null,null,null,null,null,null,null,null,"# of Strands",null,null,{"$f":"IF(AS34=0,1,AS34)","v":1},null,{"$f":"500/1.26*Q$49/Q$54","v":{"$error":"#N/A"}},{"$error":"#N/A"},null,null,null,null,null,null,null,null,"2.  Click \"Suggested Part Numbers\" to find  toroids that fit the input parameters.",null,null,null,null,null,null,null,null,null,null,null,null,"Adjust Wire AWG"]
[null,{"$f":"IF(E1=\"DC w/ ripple\",\"DC - AC Ripple Current\",(IF(E1=\"Low AC w/ ripple\",\"low AC-AC Ripple Current\",IF(E1=\"Pure AC no ripple\",\"AC min current(Sine)\"))))","v":"DC - AC Ripple Current"},null,null,{"$f":"IF(E1=\"DC w/ ripple\",E4-(0.5*E6),IF(E1=\"Low AC w/ ripple\",E4*SQRT(2)-(0.5*E6),IF(E1=\"Pure AC no ripple\",-E4*SQRT(2))))","v":0},null,null,null,null,null,null,null,null,"Current Skin Depth(mm)",null,null,{"$f":"66.3/SQRT($E$8*1000)","v":{"$error":"#DIV/0!"}},null,{"$f":"600/1.26*Q$49/Q$54","v":{"$error":"#N/A"}},{"$error":"#N/A"}]
[null,"DC or fundamental AC rms Current",null,null,{"$f":"E4","v":0},null,null,null,null,null,null,null,null,"Bare Wire Radius (mm)",null,null,{"$f":"VLOOKUP(Q31, 'Wire Table'!$A$4:$N$47,14,FALSE)","v":{"$error":"#N/A"}},null,{"$f":"700/1.26*Q$49/Q$54","v":{"$error":"#N/A"}},{"$error":"#N/A"},null,null,null,null,null,null,null,null,"3.  Enter one of the Suggested Part Numbers (or any part number) in STEP 3.",null,null,null,null,null,null,null,null,null,null,null,null,"Adjust Wire Strand"]
[null,"Fundamental AC, peak Current",null,null,{"$f":"IF(E1=\"Low AC w/ ripple\",(E4*SQRT(2))+(E6/2),\"\")","v":""},null,null,null,null,null,null,null,null,"Wire Area/ Strand (cm2)",null,null,{"$f":"VLOOKUP(Q31, 'Wire Table'!$A$4:$J$47,5,FALSE)","v":{"$error":"#N/A"}},null,{"$f":"800/1.26*Q$49/Q$54","v":{"$error":"#N/A"}},{"$error":"#N/A"}]
[null,"Specified Current",null,null,{"$f":"E7","v":0},null,null,null,null,null,null,null,null,"Wire Area/ All Strands",null,null,{"$f":"Q35*Q32","v":{"$error":"#N/A"}},null,{"$f":"900/1.26*Q$49/Q$54","v":{"$error":"#N/A"}},{"$error":"#N/A"},null,null,null,null,null,null,null,null,"4.  Click \"Design Output\" to see the result."]
[null,null,null,null,null,null,null,null,null,null,null,null,null,"Circ Mils/ All Strands",null,null,{"$f":"VLOOKUP(Q31, 'Wire Table'!$A$4:$J$47,2,FALSE)","v":{"$error":"#N/A"}},null,{"$f":"1000/1.26*Q$49/Q$54","v":{"$error":"#N/A"}},{"$error":"#N/A"}]
[null,null,null,null,null,null,null,null,null,null,null,null,null,"Resistivity(Ω-Circ Mills/FT)",null,null,{"$f":"VLOOKUP($E$11,'Wire Resistivity'!$A$2:$C$4,3,FALSE)","v":10.371},null,null,null,null,null,null,null,null,null,null,null,"5.  Adjust turns if desired by entering new turns in the input box in STEP 4, and re-clicking \"Design Output.\""]
[null,null,null,null,null,null,null,null,null,null,null,null,null,"Resistance (Ω/m) (@20 °C) all strands",null,null,{"$f":"Q38/Q37*3.281/Q32","v":{"$error":"#N/A"}}]
[null,null,null,null,null,null,null,null,null,null,null,null,null,"Resistance/mm",null,null,{"$f":"Q39*0.001","v":{"$error":"#N/A"}},null,null,null,null,null,null,null,null,null,null,null,"6.  To return to STEP 3, clear the \"Adjust Turns\" box, enter a new part number, and click \"Design Output\"."]
[null,null,null,null,null,null,null,null,null,null,null,null,null,"MLT (mm)",null,null,{"$f":"Q98","v":{"$error":"#N/A"}}]
[null,null,null,null,null,null,null,null,null,null,null,null,null,"DCR (mΩ, @ 20° C)",null,null,{"$f":"Q41*Q54*Q40*1000","v":{"$error":"#N/A"}},null,null,null,null,null,null,null,null,null,null,null,"7. Software is based on current density of 500 Amps/cm^2, when the current is larger than 66.5 Amps, no wire selection is available in the "]
[null,null,null,null,null,null,null,null,null,null,null,null,null,"ACR (mΩ, @ 20° C)",null,null,{"$f":"2.5*Q42","v":{"$error":"#N/A"}},null,null,null,null,null,null,null,null,null,null,null,"program. Please consider using multiple wires in a practical application. "]
[null,null,null,null,null,null,null,null,null,null,null,null,null," Wound Surface Area (cm2)",null,null,{"$f":"(2*Q70*Q72*Q4+4*Q70*Q71+4*Q71*Q72*Q4)*0.01","v":{"$error":"#N/A"}}]
[null,null,"Leave Blank When starting new design ------------------->",null,null,null,null,null,null,null,null,null,null,"Adjust Turns",null,null,{"$f":"IF(AS30=0,0,AS30)","v":0}]
[]
[null,null,null,null,null,null,null,null,null,null,null,null,null,"AL (nH/T2) MIN",null,null,{"$f":"Q7*0.92","v":{"$error":"#N/A"}}]
[null,null,null,null,null,null,null,null,null,null,null,null,null,"Bobbin Window Area(cm2)",null,null,{"$f":"MIN(VLOOKUP(Q3,'E Core Detail'!$A$2:$Z$100,22,FALSE),VLOOKUP(Q3,'E Core Detail'!$A$2:$Z$100,23,FALSE),VLOOKUP(Q3,'E Core Detail'!$A$2:$Z$100,24,FALSE))","v":{"$error":"#N/A"}}]
[null,null,null,null,null,null,null,null,null,null,null,null,null,"Path Length (cm)",null,null,{"$f":"VLOOKUP(Q3,'E Core Detail'!$A$2:$H$100,7,FALSE)","v":{"$error":"#N/A"}}]
[null,null,null,null,null,null,null,null,null,null,null,null,null,"Volume (cm3)",null,null,{"$f":"Q49*Q51","v":{"$error":"#N/A"}}]
[null,null,null,null,null,null,null,null,null,null,null,null,null,"Cross Section (cm2)",null,null,{"$f":"Q4*(VLOOKUP(Q3,'E Core Detail'!$A$2:$R$100,17,FALSE))","v":{"$error":"#N/A"}}]
[null,null,null,null,null,null,null,null,null,null,null,null,null,"No Load Turns",null,null,{"$f":"IF(Q45=0,ROUNDUP(SQRT((E3*10^6)/Q47),0),Q45)","v":{"$error":"#N/A"}}]
[null,null,null,null,null,null,null,null,null,null,null,null,null,"% Initial Perm at AVG Current",null,null,{"$f":"0.01*(1/(Q105+Q106*(Q121^Q107)))","v":{"$error":"#N/A"}}]
[null,null,null,null,null,null,null,null,null,null,null,null,null,"Adjusted Turns",null,null,{"$f":"IF(Q45=0,ROUNDUP(Q52/Q53,0),Q45)","v":{"$error":"#N/A"}}]
[null,null,null,null,null,null,null,null,null,null,null,null,null,"% Initial Perm Adj. Turns AVG",null,null,{"$f":"0.01*(1/(Q105+Q106*(Q123^Q107)))","v":{"$error":"#N/A"}}]
[null,null,null,null,null,null,null,null,null,null,null,null,null,"% Initial Perm Max Rip Current",null,null,{"$f":"0.01*(1/(Q105+Q106*(Q119^Q107)))","v":{"$error":"#N/A"}}]
[null,null,null,null,null,null,null,null,null,null,null,null,null,"% Initial Perm Min Rip Current",null,null,{"$f":"0.01*(1/(Q105+Q106*(Q120^Q107)))","v":{"$error":"#N/A"}}]
[null,null,null,null,null,null,null,null,null,null,null,null,null,"% Intial Perm MAX Current AC low f",null,null,{"$f":"0.01*(1/(Q105+Q106*(Q122^Q107)))","v":{"$error":"#N/A"}}]
[null,null,null,null,null,null,null,null,null,null,null,null,null,"% Intial Perm Spec. Current",null,null,{"$f":"0.01*(1/(Q105+Q106*(Q124^Q107)))","v":{"$error":"#N/A"}}]
[null,null,null,null,null,null,null,null,null,null,null,null,null,"Core Loss"]
[null,null,null,null,null,null,null,null,null,null,null,null,null,"HAC MAX",null,null,{"$f":"(Q54/Q49)*(E32)","v":{"$error":"#N/A"}}]
[null,null,null,null,null,null,null,null,null,null,null,null,null,"HAC MIN",null,null,{"$f":"(Q54/Q49)*(E33)","v":{"$error":"#N/A"}}]
[null,null,null,null,null,null,null,null,null,null,null,null,null,"BAC MAX",null,null,{"$f":"((Q110+(Q111*Q119)+(Q112*Q119^2))/(1+(Q113*Q119)+(Q114*Q119^2)))^Q115","v":{"$error":"#N/A"}}]
[null,null,null,null,null,null,null,null,null,null,null,null,null,"BAC MIN",null,null,{"$f":"IF(Q62<0,-(((Q110+(Q111*ABS(Q120))+(Q112*ABS(Q120)^2))/(1+(Q113*ABS(Q120))+(Q114*ABS(Q120)^2)))^Q115),(((Q110+(Q111*Q120)+(Q112*Q120^2))/(1+(Q113*Q120)+(Q114*Q120^2)))^Q115))","v":{"$error":"#N/A"}}]
[null,null,null,null,null,null,null,null,null,null,null,null,null,"B Peak (DeltaB/2)",null,null,{"$f":"(Q63-Q64)/2","v":{"$error":"#N/A"}}]
[null,null,null,null,null,null,null,null,null,null,null,null,null,"Core Loss (mW/cm3)",null,null,{"$f":"Q116*(Q65^Q117)*($E$8^Q118)","v":{"$error":"#N/A"}}]
[]
[]
[null,null,null,null,null,null,null,null,null,null,null,null,null,"Core Info"]
[null,null,null,null,null,null,null,null,null,null,null,null,null,"A (mm)",null,null,{"$f":"VLOOKUP(Q3,'E Core Detail'!$A$2:$X$100,9,FALSE)","v":{"$error":"#N/A"}}]
[null,null,null,null,null,null,null,null,null,null,null,null,null,"B (mm)",null,null,{"$f":"VLOOKUP(Q3,'E Core Detail'!$A$2:$X$100,10,FALSE)","v":{"$error":"#N/A"}}]
[null,null,null,null,null,null,null,null,null,null,null,null,null,"C (mm)",null,null,{"$f":"VLOOKUP(Q3,'E Core Detail'!$A$2:$X$100,11,FALSE)","v":{"$error":"#N/A"}}]
[null,null,null,null,null,null,null,null,null,null,null,null,null,"D (mm)",null,null,{"$f":"VLOOKUP(Q3,'E Core Detail'!$A$2:$X$100,12,FALSE)","v":{"$error":"#N/A"}}]
[null,null,null,null,null,null,null,null,null,null,null,null,null,"E (mm)",null,null,{"$f":"VLOOKUP(Q3,'E Core Detail'!$A$2:$X$100,13,FALSE)","v":{"$error":"#N/A"}}]
[null,null,null,null,null,null,null,null,null,null,null,null,null,"F (mm)",null,null,{"$f":"VLOOKUP(Q3,'E Core Detail'!$A$2:$X$100,14,FALSE)","v":{"$error":"#N/A"}}]
[null,null,null,null,null,null,null,null,null,null,null,null,null,"L (mm)",null,null,{"$f":"VLOOKUP(Q3,'E Core Detail'!$A$2:$X$100,15,FALSE)","v":{"$error":"#N/A"}}]
[null,null,null,null,null,null,null,null,null,null,null,null,null,"M (mm)",null,null,{"$f":"VLOOKUP(Q3,'E Core Detail'!$A$2:$X$100,16,FALSE)","v":{"$error":"#N/A"}}]
[null,null,null,null,null,null,null,null,null,null,null,null,null,"Bobbin Thickness (mm)",null,null,{"$f":"IF(Q70>35,1.78, 0.89)","v":{"$error":"#N/A"}}]
[null,null,null,null,null,null,null,null,null,null,null,null,null,"C +F+4Bob",null,null,{"$f":"(Q72*Q4+Q75+4*Q78)","v":{"$error":"#N/A"}}]
[null,null,null,null,null,null,null,null,null,null,null,null,null," Bobbin Width (mm)",null,null,{"$f":"VLOOKUP(Q3,'E Core Detail'!$A$2:$Z$100,25,FALSE)","v":{"$error":"#N/A"}}]
[null,null,null,null,null,null,null,null,null,null,null,null,null,"Wire OD (mm)",null,null,{"$f":"SQRT((4*Q36*100)/PI())","v":{"$error":"#N/A"}}]
[null,null,null,null,null,null,null,null,null,null,null,null,null,"# of Turns possible per layer",null,null,{"$f":"ROUNDDOWN((Q80*0.9)/Q81,0)","v":{"$error":"#N/A"}}]
[null,null,null,null,null,null,null,null,null,null,null,null,null,"Turns on Layer 1",null,null,{"$f":"IF(Q82>Q54, Q54,Q82)","v":{"$error":"#N/A"}}]
[null,null,null,null,null,null,null,null,null,null,null,null,null,"Turns on Layer 2",null,null,{"$f":"IF(Q21-Q83=Q21,0,IF(Q21-Q83-Q82>0,Q82,Q21-Q83))","v":{"$error":"#N/A"}}]
[null,null,null,null,null,null,null,null,null,null,null,null,null,"Turns on Layer 3",null,null,{"$f":"IF(Q21-Q83-Q84=Q21,0,IF(Q21-Q83-Q84-Q82>0,Q82,Q21-Q83-Q84))","v":{"$error":"#N/A"}}]
[null,null,null,null,null,null,null,null,null,null,null,null,null,"Turns on Layer 4",null,null,{"$f":"IF(Q$21-Q$83-Q$84-Q$85=Q$21,0,IF(Q$21-Q$83-Q$84-Q$85-Q$82>0,Q$82,Q$21-Q$83-Q$84-Q$85))","v":{"$error":"#N/A"}}]
[null,null,null,null,null,null,null,null,null,null,null,null,null,"Turns on Layer 5",null,null,{"$f":"IF(Q$21-Q$83-Q$84-Q$85-Q$86=Q$21,0,IF(Q$21-Q$83-Q$84-Q$85-Q$86-Q$82>0,Q$82,Q$21-Q$83-Q$84-Q$85-Q$86))","v":{"$error":"#N/A"}}]
[null,null,null,null,null,null,null,null,null,null,null,null,null,"Turns on Layer 6",null,null,{"$f":"IF(Q$21-Q$83-Q$84-Q$85-Q$86-Q$87=Q$21,0,IF(Q$21-Q$83-Q$84-Q$85-Q$86-Q$87-Q$82>0,Q$82,Q$21-Q$83-Q$84-Q$85-Q$86-Q$87))","v":{"$error":"#N/A"}}]
[null,null,null,null,null,null,null,null,null,null,null,null,null,"Turns on Layer 7",null,null,{"$f":"IF(Q$21-Q$83-Q$84-Q$85-Q$86-Q$87-Q$88=Q$21,0,IF(Q$21-Q$83-Q$84-Q$85-Q$86-Q$87-Q$88-Q$82>0,Q$82,Q$21-Q$83-Q$84-Q$85-Q$86-Q$87-Q$88))","v":{"$error":"#N/A"}}]
[null,null,null,null,null,null,null,null,null,null,null,null,null,"Turns on Layer 8",null,null,{"$f":"IF(Q$21-Q$83-Q$84-Q$85-Q$86-Q$87-Q$88-Q$89=Q$21,0,IF(Q$21-Q$83-Q$84-Q$85-Q$86-Q$87-Q$88-Q$89-Q$82>0,Q$82,Q$21-Q$83-Q$84-Q$85-Q$86-Q$87-Q$88-Q$89))","v":{"$error":"#N/A"}}]
[null,null,null,null,null,null,null,null,null,null,null,null,null,"Turns on Layer 9",null,null,{"$f":"IF(Q$21-Q$83-Q$84-Q$85-Q$86-Q$87-Q$88-Q$89-Q$90=Q$21,0,IF(Q$21-Q$83-Q$84-Q$85-Q$86-Q$87-Q$88-Q$89-Q$90-Q$82>0,Q$82,Q$21-Q$83-Q$84-Q$85-Q$86-Q$87-Q$88-Q$89-Q$90))","v":{"$error":"#N/A"}}]
[null,null,null,null,null,null,null,null,null,null,null,null,null,"Length per turn Layer 1 (mm)",null,null,{"$f":"2*Q79+(6.28*Q81/2)","v":{"$error":"#N/A"}}]
[null,null,null,null,null,null,null,null,null,null,null,null,null,"Length per turn Layer 2 (mm)",null,null,{"$f":"2*Q79+6.28*(1.5*Q81)","v":{"$error":"#N/A"}}]
[null,null,null,null,null,null,null,null,null,null,null,null,null,"Length per turn Layer 3",null,null,{"$f":"Q79*2+6.28*2.5*Q81","v":{"$error":"#N/A"}}]
[null,null,null,null,null,null,null,null,null,null,null,null,null,"Length per turn Layer 4",null,null,{"$f":"2*Q79+6.28*3.5*Q81","v":{"$error":"#N/A"}}]
[null,null,null,null,null,null,null,null,null,null,null,null,null,"Length per turn Layer 5",null,null,{"$f":"2*Q79+6.28*4.5*Q81","v":{"$error":"#N/A"}}]
[null,null,null,null,null,null,null,null,null,null,null,null,null,"Total wire length (mm)",null,null,{"$f":"(Q83*Q92)+(Q84*Q93)+(Q85*Q94)+(Q86*Q95)+(Q87*Q96)","v":{"$error":"#N/A"}}]
[null,null,null,null,null,null,null,null,null,null,null,null,null,"MLT (mm)",null,null,{"$f":"Q97/Q54","v":{"$error":"#N/A"}}]
[null,null,null,null,null,null,null,null,null,null,null,null,null,"Feet/Pound",null,null,{"$error":"#N/A"}]
[null,null,null,null,null,null,null,null,null,null,null,null,null,"Pounds of Wire",null,null,{"$f":"(Q24/304.8)/Q99","v":{"$error":"#N/A"}}]
[null,null,null,null,null,null,null,null,null,null,null,null,null,"Wire Price Per Pound",null,null,{"$error":"#N/A"}]
[null,null,null,null,null,null,null,null,null,null,null,null,null,"Kgs of Wire",null,null,{"$f":"Q100*0.4536","v":{"$error":"#N/A"}}]
[]
[null,null,null,null,null,null,null,null,null,null,null,null,null,"Equations"]
[null,null,null,null,null,null,null,null,null,null,null,null,null,"DC A",null,null,{"$f":"IF($Q$5=\"Kool Mu\",VLOOKUP($Q$6,'Kool Mu CF Constants'!A11:D14,2,FALSE),IF($Q$5=\"MPP\",VLOOKUP($Q$6,'MPP CF'!$A$3:$F$12,2,FALSE),IF($Q$5=\"High Flux\",VLOOKUP($Q$6,'HF CF'!$A$3:$F$9,2,FALSE),IF($Q$5=\"XFlux\",VLOOKUP($Q$6,'XF CF'!A9:D11,2,FALSE)))))","v":{"$error":"#N/A"}}]
[null,null,null,null,null,null,null,null,null,null,null,null,null,"DC B",null,null,{"$f":"IF($Q$5=\"Kool Mu\",VLOOKUP($Q$6,'Kool Mu CF Constants'!A11:D14,3,FALSE),IF($Q$5=\"MPP\",VLOOKUP($Q$6,'MPP CF'!$A$3:$F$12,3,FALSE),IF($Q$5=\"High Flux\",VLOOKUP($Q$6,'HF CF'!$A$3:$F$9,3,FALSE),IF($Q$5=\"XFlux\",VLOOKUP($Q$6,'XF CF'!A9:D11,3,FALSE)))))","v":{"$error":"#N/A"}}]
[null,null,null,null,null,null,null,null,null,null,null,null,null,"DC C",null,null,{"$f":"IF($Q$5=\"Kool Mu\",VLOOKUP($Q$6,'Kool Mu CF Constants'!A11:D14,4,FALSE),IF($Q$5=\"MPP\",VLOOKUP($Q$6,'MPP CF'!$A$3:$F$12,4,FALSE),IF($Q$5=\"High Flux\",VLOOKUP($Q$6,'HF CF'!$A$3:$F$9,4,FALSE),IF($Q$5=\"XFlux\",VLOOKUP($Q$6,'XF CF'!A9:D11,4,FALSE)))))","v":{"$error":"#N/A"}}]
[null,null,null,null,null,null,null,null,null,null,null,null,null,"DC D"]
[null,null,null,null,null,null,null,null,null,null,null,null,null,"DC E"]
[null,null,null,null,null,null,null,null,null,null,null,null,null,"NM A",null,null,{"$f":"IF($Q$5=\"Kool Mu\",VLOOKUP($Q$6,'Kool Mu CF Constants'!A16:G22,2,FALSE),IF($Q$5=\"MPP\",VLOOKUP($Q$6,'MPP CF'!$A$14:$G$23,2,FALSE),IF($Q$5=\"High Flux\",VLOOKUP($Q$6,'HF CF'!$A$11:$G$17,2,FALSE),IF($Q$5=\"XFlux\",VLOOKUP($Q$6,'XF CF'!A16:G20,2,FALSE)))))","v":{"$error":"#N/A"}}]
[null,null,null,null,null,null,null,null,null,null,null,null,null,"NM B",null,null,{"$f":"IF($Q$5=\"Kool Mu\",VLOOKUP($Q$6,'Kool Mu CF Constants'!$A$16:$G$22,3,FALSE),IF($Q$5=\"MPP\",VLOOKUP($Q$6,'MPP CF'!$A$14:$G$23,3,FALSE),IF($Q$5=\"High Flux\",VLOOKUP($Q$6,'HF CF'!$A$11:$G$17,3,FALSE),IF($Q$5=\"XFlux\",VLOOKUP($Q$6,'XF CF'!A16:G20,3,FALSE)))))","v":{"$error":"#N/A"}}]
[null,null,null,null,null,null,null,null,null,null,null,null,null,"NM C",null,null,{"$f":"IF($Q$5=\"Kool Mu\",VLOOKUP($Q$6,'Kool Mu CF Constants'!$A$16:$G$22,4,FALSE),IF($Q$5=\"MPP\",VLOOKUP($Q$6,'MPP CF'!$A$14:$G$23,4,FALSE),IF($Q$5=\"High Flux\",VLOOKUP($Q$6,'HF CF'!$A$11:$G$17,4,FALSE),IF($Q$5=\"XFlux\",VLOOKUP($Q$6,'XF CF'!A16:G20,4,FALSE)))))","v":{"$error":"#N/A"}}]
[null,null,null,null,null,null,null,null,null,null,null,null,null,"NM D",null,null,{"$f":"IF($Q$5=\"Kool Mu\",VLOOKUP($Q$6,'Kool Mu CF Constants'!$A$16:$G$22,5,FALSE),IF($Q$5=\"MPP\",VLOOKUP($Q$6,'MPP CF'!$A$14:$G$23,5,FALSE),IF($Q$5=\"High Flux\",VLOOKUP($Q$6,'HF CF'!$A$11:$G$17,5,FALSE),IF($Q$5=\"XFlux\",VLOOKUP($Q$6,'XF CF'!A16:G20,5,FALSE)))))","v":{"$error":"#N/A"}}]
[null,null,null,null,null,null,null,null,null,null,null,null,null,"NM E",null,null,{"$f":"IF($Q$5=\"Kool Mu\",VLOOKUP($Q$6,'Kool Mu CF Constants'!$A$16:$G$22,6,FALSE),IF($Q$5=\"MPP\",VLOOKUP($Q$6,'MPP CF'!$A$14:$G$23,6,FALSE),IF($Q$5=\"High Flux\",VLOOKUP($Q$6,'HF CF'!$A$11:$G$17,6,FALSE),IF($Q$5=\"XFlux\",VLOOKUP($Q$6,'XF CF'!A16:G20,6,FALSE)))))","v":{"$error":"#N/A"}}]
[null,null,null,null,null,null,null,null,null,null,null,null,null,"NM X",null,null,{"$f":"IF($Q$5=\"Kool Mu\",VLOOKUP($Q$6,'Kool Mu CF Constants'!$A$16:$G$22,7,FALSE),IF($Q$5=\"MPP\",VLOOKUP($Q$6,'MPP CF'!$A$14:$G$23,7,FALSE),IF($Q$5=\"High Flux\",VLOOKUP($Q$6,'HF CF'!$A$11:$G$17,7,FALSE),IF($Q$5=\"XFlux\",VLOOKUP($Q$6,'XF CF'!A16:G20,7,FALSE)))))","v":{"$error":"#N/A"}}]
[null,null,null,null,null,null,null,null,null,null,null,"Index",{"$f":"R5*10000+Q6*10+F8","v":{"$error":"#N/A"}},"CL A",null,null,{"$f":"VLOOKUP(M116,'CL Sum'!C9:I164,4,0)","v":{"$error":"#N/A"}}]
[null,null,null,null,null,null,null,null,null,null,null,null,null,"CL B",null,null,{"$f":"VLOOKUP(M116,'CL Sum'!C10:I165,5,0)","v":{"$error":"#N/A"}}]
[null,null,null,null,null,null,null,null,null,null,null,null,null,"CL C",null,null,{"$f":"VLOOKUP(M116,'CL Sum'!C11:I166,6,0)","v":{"$error":"#N/A"}}]
[null,null,null,null,null,null,null,null,null,null,null,null,null,"DC + AC Ripple Drive",null,null,{"$f":"$E$32*Q54/Q49","v":{"$error":"#N/A"}}]
[null,null,null,null,null,null,null,null,null,null,null,null,null,"DC-AC Ripple Drive",null,null,{"$f":"$E$33*Q54/Q49","v":{"$error":"#N/A"}}]
[null,null,null,null,null,null,null,null,null,null,null,null,null,"DC or low f AC RMS Drive Init",null,null,{"$f":"$E$34*Q52/Q49","v":{"$error":"#N/A"}}]
[null,null,null,null,null,null,null,null,null,null,null,null,null,"If low f AC Drive",null,null,{"$f":"$E$35*Q54/Q49","v":{"$error":"#VALUE!"}}]
[null,null,null,null,null,null,null,null,null,null,null,null,null,"DC or low f AC RMS Drive 2nd",null,null,{"$f":"$E$34*Q54/Q49","v":{"$error":"#N/A"}}]
[null,null,null,null,null,null,null,null,null,null,null,null,null,"Specified Current Drive",null,null,{"$f":"$E$36*Q54/Q49","v":{"$error":"#N/A"}}]
[]
[null,null,null,null,null,null,null,null,null,null,null,null,null,"Finished A(mm)",null,null,{"$f":"Q70","v":{"$error":"#N/A"}}]
[null,null,null,null,null,null,null,null,null,null,null,null,null,"Finished W (mm)",null,null,{"$f":"Q71*2","v":{"$error":"#N/A"}}]
[null,null,null,null,null,null,null,null,null,null,null,null,null,"Finished HT (mm)",null,null,{"$f":"Q72*Q4+Q23*Q81*2*1.1","v":{"$error":"#N/A"}}]
[null,null,null,null,null,null,null,null,null,null,null,null,null,"Single Core Weight(KG)",null,null,{"$f":"VLOOKUP(Q3,'Shape Core Weight'!$A$2:$D$107,4,FALSE)/1000","v":{"$error":"#N/A"}}]
[null,null,null,null,null,null,null,null,null,null,null,null,null,"Total Core Weight(KG)",null,null,{"$f":"Q4*Q129*2","v":{"$error":"#N/A"}}]
[null,null,null,null,null,null,null,null,null,null,null,null,null,"Finished Weight(kG)",null,null,{"$f":"Q130+Q102","v":{"$error":"#N/A"}}]

{"sheet":"CL Sum","index":19,"n_rows":156,"n_cols":13,"rows_kept":156,"cut":false,"hidden":true,"merged":[]}
[1,"MPP",null,"feq","Core Loss","a","b","c"]
[null,null,{"$f":"C13+1","v":10143},">25KHz",14,21.06,1.0740000000000001,1.38,null,null,null,"MPP",1]
[null,null,{"$f":"C14+1","v":10263},">25KHz",26,109.17,2,1.37,null,null,null,"High Flux",2]
[null,null,10603,">25KHz",60,31.32,1.585,1.37,null,null,null,"XFlux",3]
[null,null,11253,">25KHz",125,87.07,2.222,1.56,null,null,null,"MIX",4]
[null,null,11473,">25KHz",147,87.07,2.222,1.56,null,null,null,"Kool Mu",5]
[null,null,11603,">25KHz",160,87.07,2.222,1.56,null,null,null,"KMM",6]
[null,null,11733,">25KHz",173,87.07,2.222,1.56]
[null,null,12003,">25KHz",200,115.52,2.3220000000000001,1.59]
[null,null,13003,">25KHz",300,115.52,2.3220000000000001,1.59]
[null,null,15503,">25KHz",550,96.89,1.9990000000000001,1.54]
[]
[null,null,{"$f":"C24+1","v":10142},"10-25KHz",14,21.06,1.0740000000000001,1.38]
[null,null,{"$f":"C25+1","v":10262},"10-25KHz",26,109.17,2,1.37]
[null,null,10602,"10-25KHz",60,31.32,1.585,1.37]
[null,null,11252,"10-25KHz",125,87.07,2.222,1.56]
[null,null,11472,"10-25KHz",147,87.07,2.222,1.56]
[null,null,11602,"10-25KHz",160,87.07,2.222,1.56]
[null,null,11732,"10-25KHz",173,87.07,2.222,1.56]
[null,null,12002,"10-25KHz",200,115.52,2.3220000000000001,1.59]
[null,null,13002,"10-25KHz",300,115.52,2.3220000000000001,1.59]
[null,null,15502,"10-25KHz",550,96.89,1.9990000000000001,1.54]
[]
[null,null,{"$f":"C35+1","v":10141},"9-10KHz",14,64.02,1.0740000000000001,1.113]
[null,null,{"$f":"C36+1","v":10261},"9-10KHz",26,361.61799999999999,2,1.08]
[null,null,10601,"9-10KHz",60,80.12,1.585,1.0429999999999999]
[null,null,11251,"9-10KHz",125,254.26400000000001,2.222,1.171]
[null,null,11471,"9-10KHz",147,254.26400000000001,2.222,1.171]
[null,null,11601,"9-10KHz",160,254.26400000000001,2.222,1.171]
[null,null,11731,"9-10KHz",173,254.26400000000001,2.222,1.171]
[null,null,12001,"9-10KHz",200,320.32100000000003,2.3220000000000001,1.1870000000000001]
[null,null,13001,"9-10KHz",300,320.32100000000003,2.3220000000000001,1.1870000000000001]
[null,null,15501,"9-10KHz",550,303.42599999999999,1.9990000000000001,1.085]
[]
[null,null,10140,"<9KHz",14,64.02,1.0740000000000001,1.113]
[null,null,10260,"<9KHz",26,361.61799999999999,2,1.08]
[null,null,10600,"<9KHz",60,80.12,1.585,1.0429999999999999]
[null,null,11250,"<9KHz",125,254.26400000000001,2.222,1.171]
[null,null,11470,"<9KHz",147,254.26400000000001,2.222,1.171]
[null,null,11600,"<9KHz",160,254.26400000000001,2.222,1.171]
[null,null,11730,"<9KHz",173,254.26400000000001,2.222,1.171]
[null,null,12000,"<9KHz",200,320.32100000000003,2.3220000000000001,1.1870000000000001]
[null,null,13000,"<9KHz",300,320.32100000000003,2.3220000000000001,1.1870000000000001]
[null,null,15500,"<9KHz",550,303.42599999999999,1.9990000000000001,1.085]
[2,"High Flux",null,null,"Core Loss","a","b","c"]
[null,null,{"$f":"C53+1","v":20143},">25KHz",14,181.14400000000001,1.3859999999999999,1.2150000000000001]
[null,null,{"$f":"C54+1","v":20263},">25KHz",26,198.27500000000001,2.0419999999999998,1.349]
[null,null,{"$f":"C55+1","v":20403},">25KHz",40,137.691,2.0419999999999998,1.349]
[null,null,20603,">25KHz",60,137.691,2.0419999999999998,1.349]
[null,null,21253,">25KHz",125,53.722999999999999,2.1779999999999999,1.6759999999999999]
[null,null,21473,">25KHz",147,203.60599999999999,2.1629999999999998,1.5149999999999999]
[null,null,21603,">25KHz",160,203.60599999999999,2.1629999999999998,1.5149999999999999]
[null,null,{"$f":"C60+1","v":20142},"10-25KHz",14,181.14400000000001,1.3859999999999999,1.2150000000000001]
[null,null,{"$f":"C61+1","v":20262},"10-25KHz",26,595.86400000000003,2.0419999999999998,1.052]
[null,null,20402,"10-25KHz",40,398.89600000000002,2.0419999999999998,1.052]
[null,null,20602,"10-25KHz",60,398.89600000000002,2.0419999999999998,1.052]
[null,null,21252,"10-25KHz",125,321.28100000000001,2.1779999999999999,1.177]
[null,null,21472,"10-25KHz",147,883.51,2.1629999999999998,1.0860000000000001]
[null,null,21602,"10-25KHz",160,883.51,2.1629999999999998,1.0860000000000001]
[null,null,{"$f":"C67+1","v":20141},"9-10Khz",14,181.14400000000001,1.3859999999999999,1.2150000000000001]
[null,null,{"$f":"C68+1","v":20261},"9-10Khz",26,595.86400000000003,2.0419999999999998,1.052]
[null,null,20401,"9-10Khz",40,398.89600000000002,2.0419999999999998,1.052]
[null,null,20601,"9-10Khz",60,398.89600000000002,2.0419999999999998,1.052]
[null,null,21251,"9-10Khz",125,321.28100000000001,2.1779999999999999,1.177]
[null,null,21471,"9-10Khz",147,883.51,2.1629999999999998,1.0860000000000001]
[null,null,21601,"9-10Khz",160,883.51,2.1629999999999998,1.0860000000000001]
[null,null,20140,"0-9KHz",14,181.14400000000001,1.3859999999999999,1.2150000000000001]
[null,null,20260,"0-9KHz",26,595.86400000000003,2.0419999999999998,1.052]
[null,null,20400,"0-9KHz",40,398.89600000000002,2.0419999999999998,1.052]
[null,null,20600,"0-9KHz",60,398.89600000000002,2.0419999999999998,1.052]
[null,null,21250,"0-9KHz",125,321.28100000000001,2.1779999999999999,1.177]
[null,null,21470,"0-9KHz",147,883.51,2.1629999999999998,1.0860000000000001]
[null,null,21600,"0-9KHz",160,883.51,2.1629999999999998,1.0860000000000001]
[3,"XFlux",null,null,"Core Loss","a","b","c"]
[null,null,30193,">25KHz",19,703.39499999999998,2.1030000000000002,1.198]
[null,null,{"$f":"C82+1","v":30263},null,26,493.85300000000001,1.9770000000000001,1.2130000000000001]
[null,null,{"$f":"C83+1","v":30403},null,40,603.65899999999999,1.9339999999999999,1.137]
[null,null,30603,null,60,454.56200000000001,1.909,1.19]
[null,null,30753,null,75,566.53899999999999,2.0179999999999998,1.169]
[null,null,30903,null,90,566.53899999999999,2.0179999999999998,1.169]
[null,null,30192,"10-25KHz",19,756.31200000000001,2.1030000000000002,1.1819999999999999]
[null,null,{"$f":"C88+1","v":30262},null,26,771.12599999999998,1.9770000000000001,1.048]
[null,null,{"$f":"C89+1","v":30402},null,40,603.65899999999999,1.9339999999999999,1.137]
[null,null,30602,null,60,454.56200000000001,1.909,1.19]
[null,null,30752,null,75,566.53899999999999,2.0179999999999998,1.169]
[null,null,30902,null,90,566.53899999999999,2.0179999999999998,1.169]
[null,null,30191,"9-10KHz",19,756.31200000000001,2.1030000000000002,1.1819999999999999]
[null,null,{"$f":"C94+1","v":30261},null,26,771.12599999999998,1.9770000000000001,1.048]
[null,null,{"$f":"C95+1","v":30401},null,40,603.65899999999999,1.9339999999999999,1.137]
[null,null,30601,null,60,454.56200000000001,1.909,1.19]
[null,null,30751,null,75,566.53899999999999,2.0179999999999998,1.169]
[null,null,30901,null,90,566.53899999999999,2.0179999999999998,1.169]
[null,null,30190,"0-9KHz",19,756.31200000000001,2.1030000000000002,1.1819999999999999]
[null,null,30260,null,26,771.12599999999998,1.9770000000000001,1.048]
[null,null,30400,null,40,956.19500000000005,1.9339999999999999,1.0620000000000001]
[null,null,30600,null,60,670.26300000000003,1.909,1.0640000000000001]
[null,null,30750,null,75,862.34100000000001,2.0179999999999998,1.0249999999999999]
[null,null,30900,null,90,862.34100000000001,2.0179999999999998,1.0249999999999999]
[]
[4,75,null,null,"Core Loss","a","b","c"]
[null,null,{"$f":"C104+1","v":40263},">25KHz",26,271,2.0310000000000001,1.44]
[null,null,{"$f":"C105+1","v":40403},null,40,309,2.14,1.46]
[null,null,40603,null,60,251.4,2.0659999999999998,1.41]
[null,null,{"$f":"C107+1","v":40262},"10-25KHz",26,271,2.0310000000000001,1.44]
[null,null,{"$f":"C108+1","v":40402},null,40,309,2.14,1.46]
[null,null,40602,null,60,251.4,2.0659999999999998,1.41]
[null,null,{"$f":"C110+1","v":40261},"9-10KHz",26,271,2.0310000000000001,1.44]
[null,null,{"$f":"C111+1","v":40401},null,40,309,2.14,1.46]
[null,null,40601,null,60,251.4,2.0659999999999998,1.41]
[null,null,40260,"0-9KHz",26,271,2.0310000000000001,1.44]
[null,null,40400,null,40,309,2.14,1.46]
[null,null,40600,null,60,251.4,2.0659999999999998,1.41]
[5,"Kool Mu",{"$f":"C120+1","v":50143},">25KHz",14,21.491,1,1.3340000000000001]
[null,null,{"$f":"C121+1","v":50263},null,26,45.478999999999999,1.774,1.4650000000000001]
[null,null,50403,null,40,45.478999999999999,1.774,1.4650000000000001]
[null,null,50603,null,60,62.65,1.7809999999999999,1.3620000000000001]
[null,null,50753,null,75,146.80600000000001,2.0219999999999998,1.3340000000000001]
[null,null,50903,null,90,146.80600000000001,2.0219999999999998,1.3340000000000001]
[null,null,51253,null,125,71.930000000000007,1.9279999999999999,1.4730000000000001]
[null,null,{"$f":"C127+1","v":50142},"10-25KHz",14,21.491,1,1.3340000000000001]
[null,null,{"$f":"C128+1","v":50262},null,26,45.478999999999999,1.774,1.4650000000000001]
[null,null,50402,null,40,45.478999999999999,1.774,1.4650000000000001]
[null,null,50602,null,60,62.65,1.7809999999999999,1.3620000000000001]
[null,null,50752,null,75,146.80600000000001,2.0219999999999998,1.3340000000000001]
[null,null,50902,null,90,146.80600000000001,2.0219999999999998,1.3340000000000001]
[null,null,51252,null,125,71.930000000000007,1.9279999999999999,1.4730000000000001]
[null,null,{"$f":"C134+1","v":50141},"9-10KKHz",14,40.183999999999997,1,1.2150000000000001]
[null,null,{"$f":"C135+1","v":50261},null,26,170.17099999999999,1.774,1.028]
[null,null,50401,null,40,170.17099999999999,1.774,1.028]
[null,null,50601,null,60,62.65,1.7809999999999999,1.3620000000000001]
[null,null,50751,null,75,338.51100000000002,2.0219999999999998,1.0489999999999999]
[null,null,50901,null,90,338.51100000000002,2.0219999999999998,1.0489999999999999]
[null,null,51251,null,125,228.46199999999999,1.9279999999999999,1.046]
[null,null,50140,"0-9KHz",14,40.183999999999997,1,1.2150000000000001]
[null,null,50260,null,26,170.17099999999999,1.774,1.028]
[null,null,50400,null,40,170.17099999999999,1.774,1.028]
[null,null,50600,null,60,136.93100000000001,1.7809999999999999,1.123]
[null,null,50750,null,75,338.51100000000002,2.0219999999999998,1.0489999999999999]
[null,null,50900,null,90,338.51100000000002,2.0219999999999998,1.0489999999999999]
[null,null,51250,null,125,228.46199999999999,1.9279999999999999,1.046]
[6,79,60193,">25KHz",19,149.797,2.141,1.381]
[null,null,{"$f":"C146+1","v":60263},null,26,86.004999999999995,1.998,1.4019999999999999]
[null,null,60403,null,40,86.004999999999995,1.998,1.4019999999999999]
[null,null,{"$f":"C148+1","v":60603},null,60,86.004999999999995,1.998,1.4019999999999999]
[null,null,60192,"10-25KHz",19,468.97800000000001,2.141,1.0669999999999999]
[null,null,{"$f":"C150+1","v":60262},null,26,86.004999999999995,1.998,1.4019999999999999]
[null,null,60402,null,40,86.004999999999995,1.998,1.4019999999999999]
[null,null,{"$f":"C152+1","v":60602},null,60,86.004999999999995,1.998,1.4019999999999999]
[null,null,60191,"9-10KHz",19,468.97800000000001,2.141,1.0669999999999999]
[null,null,{"$f":"C154+1","v":60261},null,26,94.674000000000007,1.998,1.4019999999999999]
[null,null,60401,null,40,94.674000000000007,1.998,1.4019999999999999]
[null,null,{"$f":"C156+1","v":60601},null,60,94.674000000000007,1.998,1.4019999999999999]
[null,null,60190,"0-9KHz",19,468.97800000000001,2.141,1.0669999999999999]
[null,null,60260,null,26,94.674000000000007,1.998,1.4019999999999999]
[null,null,60400,null,40,94.674000000000007,1.998,1.4019999999999999]
[null,null,60600,null,60,94.674000000000007,1.998,1.4019999999999999]

{"sheet":"LI_79","index":20,"n_rows":38,"n_cols":10,"rows_kept":38,"cut":false,"hidden":true,"merged":[]}
[null,"Size Code","Max","125u","90u","75u","60u","40u","26u","19u"]
[null,"140",0,null,0]
[null,"150",0,null,0]
[null,"180",0,null,0]
[null,"020",0,null,0]
[null,"240",0,null,0]
[null,"270",0,null,0]
[null,"410",0,null,0]
[null,"030",0,null,0]
[null,"280",0,null,0]
[null,"290",0,null,0]
[null,"040",0,null,0]
[null,"130",0,null,0]
[null,"050",0.15249038158418105,null,null,null,0.15249038158418105,0.10449530246747886,7.0767989880257842E-2,5.2102786868239208E-2]
[null,"380",0.55113930540644906,null,null,null,0.55113930540644906,0.36506619170694049,0.25344910593090075,0.187083764928894]
[null,"120",0.67051094621157004,null,null,null,0.67051094621157004,0.47246419398777395,0.30529290252971442,0.22454888266974019]
[null,"206",1.5056412214646331,null,null,null,1.5056412214646331,1.0352669693894092,0.72690280555985554,0.52207592245390766]
[null,"310",3.0129637469294726,null,null,null,3.0129637469294726,2.1521061740268039,1.4995972726270856,1.1127218493863518]
[null,"350",3.978681648669427,null,null,null,3.978681648669427,2.8157587727580142,1.9417493026878707,1.4225665111593537]
[null,"930",6.4758460325628562,null,null,null,6.4758460325628562,4.5671759268844401,3.105541269887854,2.2474073483891606]
[null,"548",16.18790830674816,null,null,null,16.18790830674816,12.219472487946234,9.3323903467301736,6.7764949019989738]
[null,"585",16.721360507318099,null,null,null,16.721360507318099,13.030797347619018,9.7438019295955858,7.5075333399745112]
[null,"324",21.588807535441802,null,null,null,21.588807535441802,16.460124784498586,12.210677707312648,9.3575542844391109]
[null,"254",41.289236964566804,null,null,null,41.289236964566804,32.328639177306911,24.312007477159533,18.520201982306428]
[null,"438",72.464603452471366,null,null,null,72.464603452471366,35.14685306846097,41.451592126933761,19.365461346809248]
[null,"715",90.891648970585692,null,null,null,90.891648970585692,78.93645946364029,64.697911494194685,48.841598187303127]
[null,"089",101.97259985213793,null,null,null,78.36282075532813,101.97259985213793,50.949416034805466,61.525634104355063]
[null,"195",105.13446985748097,null,null,null,105.13446985748097,81.15783964906494,60.70296134405843,45.516402665275713]
[null,725,105.14819309239273,null,null,null,105.14819309239273,80.785402886830738,59.809881417223764,44.993951912505331]
[null,"109",128.90573513737749,null,null,null,128.90573513737749,126.21395183000908,109.68814502149496,85.385413332751895]
[null,"620",277.45373425672278,null,null,null,277.45373425672278,233.26471091161505,186.61409278364061,142.40353079267422]
[null,"070",278.69946760277764,null,null,null,278.69946760277764,253.52484121484292,207.72339936344972,161.36760350198603]
[null,"866",308.10205284380339,null,null,null,227.47496892972484,308.10205284380339,296.29993249901787,244.04522991297677]
[null,"906",391.3135330618457,null,null,null,285.77077898973602,391.3135330618457,366.16058581263371,299.96695926050455]
[null,"778",497.95558238961507,null,null,null,497.95558238961507,471.05326628748134,402.17682410500606,312.35738356612114]
[null,"740",732.19578276669972,null,null,null,580.50332960859021,732.19578276669972,667.53120631157162,537.51207041840996]
[null,"102",832.38949070568117,null,null,null,550.90209966785483,791.41539564811455,832.38949070568117,701.60299862767613]
[null,"337",4064.4675899305589,null,null,null,null,null,3143.9571391146246,4064.4675899305589]

{"sheet":"PN_79","index":21,"n_rows":38,"n_cols":10,"rows_kept":38,"cut":false,"hidden":true,"merged":[]}
[null,"Size Code","Max","125u","90u","75u","60u","40u","26u","19u"]
[null,"140",null,0,0,0,0,0,0]
[null,"150",null,0,0,0,0,0,0]
[null,"180",null,0,0,0,0,0,0]
[null,"020",null,0,0,0,0,0,0]
[null,"240",null,0,0,0,0,0,0]
[null,"270",null,0,0,0,0,0,0]
[null,"030",null,0,0,0,0,0,0]
[null,"410",null,0,0,0,0,0,0]
[null,"280",null,0,0,0,0,0,0]
[null,"290",null,0,0,0,0,0,0]
[null,"040",null,0,0,0,0,0,0]
[null,"130",null,0,0,0,0,0,0]
[null,"050",null,null,null,null,79051,79056,79052,79057]
[null,380,null,null,null,null,79381,79386,79382,79387]
[null,120,null,null,null,null,79121,79113,79122,79226]
[null,"206",null,null,null,null,79848,79847,79208,79849]
[null,"310",null,null,null,null,79059,79316,79312,79303]
[null,"350",null,null,null,null,79351,79356,79352,79357]
[null,"930",null,null,null,null,79894,79936,79932,79937]
[null,548,null,null,null,null,79071,79555,79550,79554]
[null,585,null,null,null,null,79586,79591,79587,79592]
[null,"324",null,null,null,null,79076,79330,79326,79317]
[null,"254",null,null,null,null,79083,79260,79256,79262]
[null,438,null,null,null,null,79439,79091,79440,79079]
[null,"715",null,null,null,null,79716,79721,79717,79708]
[null,89,null,null,null,null,79090,79431,79091,79430]
[null,"195",null,null,null,null,79192,79189,79191,79188]
[null,725,null,null,null,null,"79726",79733,"79727","79750"]
[null,"109",null,null,null,null,79110,79212,79111,79215]
[null,"620",null,null,null,null,79617,79616,79615,79612]
[null,"070",null,null,null,null,79072,79073,79074,79067]
[null,866,null,null,null,null,79867,79872,79868,79873]
[null,906,null,null,null,null,79907,79912,79908,79913]
[null,778,null,null,null,null,79777,"79776",79775,"79772"]
[null,740,null,null,null,null,79737,79736,79735,79744]
[null,102,null,null,null,null,79099,79100,79102,79097]
[null,337,null,null,null,null,null,null,79337,79342]

{"sheet":"LI_Xflux_E","index":22,"n_rows":14,"n_cols":7,"rows_kept":14,"cut":false,"hidden":true,"merged":[]}
[null,null,null,"60u","40u","26u"]
[null,"1808E",0.31790279107389219,0.31790279107389219,0.23324959844024828,0.17468644864241606,14.354269295784219]
[null,"3515E",7.0457631870749609,7.0457631870749609,5.3136331033670876,4.0765955837943224,34.057967289186841]
[null,"4317E",14.001691449151666,14.001691449151666,10.483529496737555,7.9650797718218662,39.233793934687327]
[null,"4020E",33.370564732703848,33.370564732703848,25.086745688922569,19.405068342104165,101.51875658112716]
[null,"4017E",38.948393303659337,38.948393303659337,30.464322948961371,24.153764333609811,112.26621514685409]
[null,"4022E",38.379100354447921,38.379100354447921,28.762843257453252,22.205183066564594,184.89318874043491]
[null,"5528E",100.03118944281135,100.03118944281135,76.065899017680209,59.507701776902884,287.39581222752918]
[null,"5530E",110.41394401422347,110.41394401422347,83.497518056167976,64.96183647767522,460.54759664414024]
[null,"7228E",185.04243432988596,185.04243432988596,147.79039052432972,120.34556027912066,264.26452094396842]
[null,"6527E",287.20723374852338,287.20723374852338,241.37112138846263,185.19602482312951,848.41445682451922]
[null,"8020E",478.56737797107877,478.56737797107877,432.25758454893628,357.49508420024875,0]
[null,"8044E",862.72190696686312,675.67224469212022,801.6831904415053,862.72190696686312]
[null,"114LE",1531.6682772238937,1531.6682772238937,1368.0387612934987,1119.7460976184973]

{"sheet":"PN_XFlux_E","index":23,"n_rows":14,"n_cols":6,"rows_kept":14,"cut":false,"hidden":true,"merged":[]}
[null,null,null,60,40,26]
[null,null,"X1808E060","00X1808E060","00X1808E040","00X1808E026"]
[null,null,"X3515E060","00X3515E060","00X3515E040","00X3515E026"]
[null,null,"X4317E060","00X4317E060","00X4317E040","00X4317E026"]
[null,null,"X4020E060","00X4020E060","00X4020E040","00X4020E026"]
[null,null,"X4022E060","00X4022E060","00X4022E040","00X4022E026"]
[null,null,"X5528E060","00X5528E060","00X5528E040","00X5528E026"]
[null,null,"X5530E060","00X5530E060","00X5530E040","00X5530E026"]
[null,null,"X7228E060","00X7228E060","00X7228E040","00X7228E026"]
[null,null,"X6527E060","00X6527E060","00X6527E040","00X6527E026"]
[null,null,"X8020E060","00X8020E060","00X8020E040","00X8020E026"]
[null,null,"X8024E060","00X8024E060","00X8024E040","00X8024E026"]
[null,null,"X8044E026","00X8044E060","00X8044E040","00X8044E026"]
[null,null,"X114LE026","00X114LE060","00X114LE040","00X114LE026"]

{"sheet":"E Core Detail","index":24,"n_rows":95,"n_cols":27,"rows_kept":95,"cut":false,"hidden":true,"merged":[]}
["Sales Part Number","Base Part Number","Perm","Material","AL [nH/T2]","Shape","Le [cm]","Le [mm]","A (mm)","B (mm)","C (mm)","D (mm)","E (mm)","F (mm)","L (mm)","M (mm)","Ae [cm2]","Ae [mm2]","Ve [cm3]","Ve [mm3]","WA w/o bobbin  (mm2)","WA w/o bobbin  (cm2)","WA w/ PC bobbin  (cm2)","WA w/ Plain bobbin  (cm2)","Bobbin Width  (mm)","2D","Bobbin Thickness"]
["00K1808E026","1808",26,"Kool Mu",26,"E Core",4.01,40.099999999999994,19.3,8.1,4.78,5.53,13.9,4.78,2.39,4.6399999999999997,0.22800000000000001,22.8,0.91400000000000003,914,{"$f":"2*L2*P2","v":51.318399999999997},{"$f":"0.01*U2","v":0.51318399999999997},0.316,0.34200000000000003,9.3000000000000007,{"$f":"2*L2","v":11.06},{"$f":"0.5*(Z2-Y2)","v":0.87999999999999989}]
["00K1808E040","1808",40,"Kool Mu",35,"E Core",4.01,40.099999999999994,19.3,8.1,4.78,5.53,13.9,4.78,2.39,4.6399999999999997,0.22800000000000001,22.8,0.91400000000000003,914,{"$f":"2*L3*P3","v":51.318399999999997},{"$f":"0.01*U3","v":0.51318399999999997},0.316,0.34200000000000003,9.3000000000000007,{"$f":"2*L3","v":11.06},{"$f":"0.5*(Z3-Y3)","v":0.87999999999999989}]
["00K1808E060","1808",60,"Kool Mu",48,"E Core",4.01,40.099999999999994,19.3,8.1,4.78,5.53,13.9,4.78,2.39,4.6399999999999997,0.22800000000000001,22.8,0.91400000000000003,914,51.318399999999997,0.51318399999999997,0.316,0.34200000000000003,9.3000000000000007,11.06,0.87999999999999989]
["00K1808E090","1808",90,"Kool Mu",69,"E Core",4.01,40.099999999999994,19.3,8.1,4.78,5.53,13.9,4.78,2.39,4.6399999999999997,0.22800000000000001,22.8,0.91400000000000003,914,51.318399999999997,0.51318399999999997,0.316,0.34200000000000003,9.3000000000000007,11.06,0.87999999999999989]
["00K2510E026","2510",26,"Kool Mu",39,"E Core",4.8500000000000005,48.500000000000007,25.4,9.5299999999999994,6.35,6.22,18.7,6.35,3.18,6.24,0.38500000000000001,38.5,1.87,1870,77.625600000000006,0.77625600000000006,0.40600000000000003,0.51,10.57,12.44,0.93499999999999961]
["00K2510E040","2510",40,"Kool Mu",52,"E Core",4.8500000000000005,48.500000000000007,25.4,9.5299999999999994,6.35,6.22,18.7,6.35,3.18,6.24,0.38500000000000001,38.5,1.87,1870,77.625600000000006,0.77625600000000006,0.40600000000000003,0.51,10.57,12.44,0.93499999999999961]
["00K2510E060","2510",60,"Kool Mu",70,"E Core",4.8500000000000005,48.500000000000007,25.4,9.5299999999999994,6.35,6.22,18.7,6.35,3.18,6.24,0.38500000000000001,38.5,1.87,1870,77.625600000000006,0.77625600000000006,0.40600000000000003,0.51,10.57,12.44,0.93499999999999961]
["00K2510E090","2510",90,"Kool Mu",100,"E Core",4.8500000000000005,48.500000000000007,25.4,9.5299999999999994,6.35,6.22,18.7,6.35,3.18,6.24,0.38500000000000001,38.5,1.87,1870,77.625600000000006,{"$f":"0.01*U9","v":0.77625600000000006},0.40600000000000003,0.51,10.57,12.44,0.93499999999999961]
["00K3007E026","3007",26,"Kool Mu",33,"E Core",6.56,65.599999999999994,30.1,15,7.06,9.5500000000000007,19.8,6.96,5.1100000000000003,6.32,0.60099999999999998,60.099999999999994,3.94,3940,120.71200000000002,1.2071200000000002,0.83299999999999996,{"$f":"W10","v":0.83299999999999996},17.27,19.100000000000001,0.91500000000000092]
["00K3007E040","3007",40,"Kool Mu",46,"E Core",6.56,65.599999999999994,30.1,15,7.06,9.5500000000000007,19.8,6.96,5.1100000000000003,6.32,0.60099999999999998,60.099999999999994,3.94,3940,120.71200000000002,1.2071200000000002,0.83299999999999996,{"$f":"W11","v":0.83299999999999996},17.27,19.100000000000001,0.91500000000000092]
["00K3007E060","3007",60,"Kool Mu",71,"E Core",6.56,65.599999999999994,30.1,15,7.06,9.5500000000000007,19.8,6.96,5.1100000000000003,6.32,0.60099999999999998,60.099999999999994,3.94,3940,120.71200000000002,1.2071200000000002,0.83299999999999996,{"$f":"W12","v":0.83299999999999996},17.27,19.100000000000001,0.91500000000000092]
["00K3007E090","3007",90,"Kool Mu",92,"E Core",6.56,65.599999999999994,30.1,15,7.06,9.5500000000000007,19.8,6.96,5.1100000000000003,6.32,0.60099999999999998,60.099999999999994,3.94,3940,120.71200000000002,1.2071200000000002,0.83299999999999996,{"$f":"W13","v":0.83299999999999996},17.27,19.100000000000001,0.91500000000000092]
["00K3515E026","3515",26,"Kool Mu",56,"E Core",6.94,69.400000000000006,34.54,14.2,9.35,9.6,25.2,9.32,4.45,7.87,0.84,84,5.83,5830,151.10399999999998,1.5110399999999999,0.94799999999999995,1.1299999999999999,16.59,19.2,1.3049999999999997]
["00K3515E040","3515",40,"Kool Mu",75,"E Core",6.94,69.400000000000006,34.54,14.2,9.35,9.6,25.2,9.32,4.45,7.87,0.84,84,5.83,5830,151.10399999999998,1.5110399999999999,0.94799999999999995,1.1299999999999999,16.59,19.2,1.3049999999999997]
["00K3515E060","3515",60,"Kool Mu",102,"E Core",6.94,69.400000000000006,34.54,14.2,9.35,9.6,25.2,9.32,4.45,7.87,0.84,84,5.83,5830,151.10399999999998,1.5110399999999999,0.94799999999999995,1.1299999999999999,16.59,19.2,1.3049999999999997]
["00K3515E090","3515",90,"Kool Mu",146,"E Core",6.94,69.400000000000006,34.54,14.2,9.35,9.6,25.2,9.32,4.45,7.87,0.84,84,5.83,5830,151.10399999999998,1.5110399999999999,0.94799999999999995,1.1299999999999999,16.59,19.2,1.3049999999999997]
["00K4017E026","4017",26,"Kool Mu",56,"E Core",9.84,98.4,42.85,21.1,10.8,14.9,30.35,11.9,5.94,9.27,1.28,128,12.6,12600,276.24599999999998,2.7624599999999999,{"$f":"V18*0.7","v":1.9337219999999997},{"$f":"V18*0.7","v":1.9337219999999997},{"$f":"0.85*Z18","v":25.33},29.8,2.2350000000000012]
["00K4017E040","4017",40,"Kool Mu",76,"E Core",9.84,98.4,42.85,21.1,10.8,14.9,30.35,11.9,5.94,9.27,1.28,128,12.6,12600,276.24599999999998,2.7624599999999999,{"$f":"V19*0.7","v":1.9337219999999997},{"$f":"V19*0.7","v":1.9337219999999997},{"$f":"0.85*Z19","v":25.33},29.8,2.2350000000000012]
["00K4017E060","4017",60,"Kool Mu",105,"E Core",9.84,98.4,42.85,21.1,10.8,14.9,30.35,11.9,5.94,9.27,1.28,128,12.6,12600,276.24599999999998,2.7624599999999999,{"$f":"V20*0.7","v":1.9337219999999997},{"$f":"V20*0.7","v":1.9337219999999997},{"$f":"0.85*Z20","v":25.33},29.8,2.2350000000000012]
["00K4017E090","4017",90,"Kool Mu",151,"E Core",9.84,98.4,42.85,21.1,10.8,14.9,30.35,11.9,5.94,9.27,1.28,128,12.6,12600,276.24599999999998,2.7624599999999999,{"$f":"V21*0.7","v":1.9337219999999997},{"$f":"V21*0.7","v":1.9337219999999997},{"$f":"0.85*Z21","v":25.33},29.8,2.2350000000000012]
["00K4020E026","4020",26,"Kool Mu",80,"E Core",9.84,98.4,42.85,21.1,15.4,14.9,30.35,11.9,5.94,9.27,1.83,183,18,18000,{"$f":"2*L22*P22","v":276.24599999999998},2.7624599999999999,1.94,2.0699999999999998,25.9,29.8,1.9500000000000011]
["00K4020E040","4020",40,"Kool Mu",108,"E Core",9.84,98.4,42.85,21.1,15.4,14.9,30.35,11.9,5.94,9.27,1.83,183,18,18000,276.24599999999998,2.7624599999999999,1.94,2.0699999999999998,25.9,29.8,1.9500000000000011]
["00K4020E060","4020",60,"Kool Mu",150,"E Core",9.84,98.4,42.85,21.1,15.4,14.9,30.35,11.9,5.94,9.27,1.83,183,18,18000,276.24599999999998,2.7624599999999999,1.94,2.0699999999999998,25.9,29.8,1.9500000000000011]
["00K4020E090","4020",90,"Kool Mu",217,"E Core",9.84,98.4,42.85,21.1,15.4,14.9,30.35,11.9,5.94,9.27,1.83,183,18,18000,276.24599999999998,2.7624599999999999,1.94,2.0699999999999998,25.9,29.8,1.9500000000000011]
["00K4022E026","4022",26,"Kool Mu",104,"E Core",9.84,98.4,42.85,21.1,20,14.9,30.35,11.9,5.94,9.27,2.37,237,23.3,23300,276.24599999999998,2.7624599999999999,1.94,{"$f":"W26","v":1.94},26,29.8,1.9000000000000004]
["00K4022E040","4022",40,"Kool Mu",140,"E Core",9.84,98.4,42.85,21.1,20,14.9,30.35,11.9,5.94,9.27,2.37,237,23.3,23300,276.24599999999998,2.7624599999999999,1.94,{"$f":"W27","v":1.94},26,29.8,1.9000000000000004]
["00K4022E060","4022",60,"Kool Mu",194,"E Core",9.84,98.4,42.85,21.1,20,14.9,30.35,11.9,5.94,9.27,2.37,237,23.3,23300,276.24599999999998,2.7624599999999999,1.94,{"$f":"W28","v":1.94},26,29.8,1.9000000000000004]
["00K4022E090","4022",90,"Kool Mu",281,"E Core",9.84,98.4,42.85,21.1,20,14.9,30.35,11.9,5.94,9.27,2.37,237,23.3,23300,276.24599999999998,2.7624599999999999,1.94,{"$f":"W29","v":1.94},26,29.8,1.9000000000000004]
["00K4317E026","4317",26,"Kool Mu",88,"E Core",7.75,77.5,40.869999999999997,16.5,12.5,10.3,28.32,12.5,6.05,7.87,1.52,152,11.8,11800,162.12200000000001,1.6212200000000001,1.01,1.26,18.11,20.6,1.245000000000001]
["00K4317E040","4317",40,"Kool Mu",119,"E Core",7.75,77.5,40.869999999999997,16.5,12.5,10.3,28.32,12.5,6.05,7.87,1.52,152,11.8,11800,162.12200000000001,1.6212200000000001,1.01,1.26,18.11,20.6,1.245000000000001]
["00K4317E060","4317",60,"Kool Mu",163,"E Core",7.75,77.5,40.869999999999997,16.5,12.5,10.3,28.32,12.5,6.05,7.87,1.52,152,11.8,11800,162.12200000000001,1.6212200000000001,1.01,1.26,18.11,20.6,1.245000000000001]
["00K4317E090","4317",90,"Kool Mu",234,"E Core",7.75,77.5,40.869999999999997,16.5,12.5,10.3,28.32,12.5,6.05,7.87,1.52,152,11.8,11800,162.12200000000001,1.6212200000000001,1.01,1.26,18.11,20.6,1.245000000000001]
["00K5528E026","5528",26,"Kool Mu",116,"E Core",12.3,123,54.86,27.56,20.6,18.5,37.49,16.8,8.3800000000000008,10.199999999999999,3.5,350,43.1,43100,377.4,3.774,3.02,3.02,33.4,37,1.8000000000000007]
["00K5528E040","5528",40,"Kool Mu",157,"E Core",12.3,123,54.86,27.56,20.6,18.5,37.49,16.8,8.3800000000000008,10.199999999999999,3.5,350,43.1,43100,377.4,3.774,3.02,3.02,33.4,37,1.8000000000000007]
["00K5528E060","5528",60,"Kool Mu",219,"E Core",12.3,123,54.86,27.56,20.6,18.5,37.49,16.8,8.3800000000000008,10.199999999999999,3.5,350,43.1,43100,377.4,3.774,3.02,3.02,33.4,37,1.8000000000000007]
["00K5528E090","5528",90,"Kool Mu",322,"E Core",12.3,123,54.86,27.56,20.6,18.5,37.49,16.8,8.3800000000000008,10.199999999999999,3.5,350,43.1,43100,377.4,3.774,3.02,3.02,33.4,37,1.8000000000000007]
["00K5530E026","5530",26,"Kool Mu",138,"E Core",12.3,123,54.86,27.56,24.6,18.5,37.49,16.8,8.3800000000000008,10.199999999999999,4.17,417,51.3,51300,377.4,3.774,2.89,{"$f":"W38","v":2.89},33.4,37,1.8000000000000007]
["00K5530E040","5530",40,"Kool Mu",187,"E Core",12.3,123,54.86,27.56,24.6,18.5,37.49,16.8,8.3800000000000008,10.199999999999999,4.17,417,51.3,51300,377.4,3.774,2.89,{"$f":"W39","v":2.89},33.4,37,1.8000000000000007]
["00K5530E060","5530",60,"Kool Mu",261,"E Core",12.3,123,54.86,27.56,24.6,18.5,37.49,16.8,8.3800000000000008,10.199999999999999,4.17,417,51.3,51300,377.4,3.774,2.89,{"$f":"W40","v":2.89},33.4,37,1.8000000000000007]
["00K5530E090","5530",90,"Kool Mu",338,"E Core",12.3,123,54.86,27.56,24.6,18.5,37.49,16.8,8.3800000000000008,10.199999999999999,4.17,417,51.3,51300,377.4,3.774,2.89,{"$f":"W41","v":2.89},33.4,37,1.8000000000000007]
["00K6527E026","6527",26,"Kool Mu",162,"E Core",14.7,147,65.150000000000006,32.51,27,22.1,44.19,19.7,10,12,5.4,540,79.400000000000006,79400,530.40000000000009,5.3040000000000012,{"$f":"X42","v":4.54},4.54,39.5,44.2,2.3500000000000014]
["00K6527E040","6527",40,"Kool Mu",230,"E Core",14.7,147,65.150000000000006,32.51,27,22.1,44.19,19.7,10,12,5.4,540,79.400000000000006,79400,530.40000000000009,5.3040000000000012,4.54,4.54,39.5,44.2,2.3500000000000014]
["00K6527E060","6527",60,"Kool Mu",300,"E Core",14.7,147,65.150000000000006,32.51,27,22.1,44.19,19.7,10,12,5.4,540,79.400000000000006,79400,530.40000000000009,5.3040000000000012,4.54,4.54,39.5,44.2,2.3500000000000014]
["00K7228E026","7228",26,"Kool Mu",130,"E Core",13.7,137,72.39,27.94,19.100000000000001,17.7,52.62,19.100000000000001,9.5299999999999994,16.8,3.68,368,50.4,50400,594.72,5.9472000000000005,4.08,4.08,30.4,35.4,2.5]
["00K7228E040","7228",40,"Kool Mu",173,"E Core",13.7,137,72.39,27.94,19.100000000000001,17.7,52.62,19.100000000000001,9.5299999999999994,16.8,3.68,368,50.4,50400,594.72,5.9472000000000005,4.08,4.08,30.4,35.4,2.5]
["00K7228E060","7228",60,"Kool Mu",235,"E Core",13.7,137,72.39,27.94,19.100000000000001,17.7,52.62,19.100000000000001,9.5299999999999994,16.8,3.68,368,50.4,50400,594.72,5.9472000000000005,4.08,4.08,30.4,35.4,2.5]
["00K8020E026","8020",26,"Kool Mu",103,"E Core",18.5,185,80.010000000000005,38.1,19.8,28.01,59.28,19.8,9.91,19.8,3.89,389,72,72000,1109.1960000000001,11.091960000000002,8.06,8.06,51,56.02,2.5100000000000016]
["00K8020E040","8020",40,"Kool Mu",145,"E Core",18.5,185,80.010000000000005,38.1,19.8,28.01,59.28,19.8,9.91,19.8,3.89,389,72,72000,1109.1960000000001,11.091960000000002,8.06,8.06,51,56.02,2.5100000000000016]
["00K8020E060","8020",60,"Kool Mu",190,"E Core",18.5,185,80.010000000000005,38.1,19.8,28.01,59.28,19.8,9.91,19.8,3.89,389,72,72000,1109.1960000000001,11.091960000000002,8.06,8.06,51,56.02,2.5100000000000016]
["00K8044E026","8044",26,"Kool Mu",91,"E Core",20.8,208,80.010000000000005,44.58,19.8,34.36,59.28,19.8,9.91,19.8,3.89,389,80.900000000000006,80900,1360.6559999999999,13.60656,{"$f":"V51*0.7","v":9.5245920000000002},{"$f":"W51","v":9.5245920000000002},{"$f":"0.85*Z51","v":58.411999999999999},68.72,5.1539999999999999]
["00K130LE026","130LE",26,"Kool Mu",254,"E Core",21.9,219,130.30000000000001,32.51,53.85,22.1,108.4,20,10,44.22,10.8,1080,237,237000,1954.5240000000001,19.545240000000003,{"$f":"V52*0.7","v":13.681668000000002},{"$f":"W52","v":13.681668000000002},{"$f":"0.85*Z52","v":37.57},44.2,3.3150000000000013]
["00K160LE026","160LE",26,"Kool Mu",180,"E Core",27.3,273,160,38.1,39.619999999999997,28.14,138.19999999999999,19.8,9.91,59.28,7.78,778,212,212000,3336.2784000000001,33.362784000000005,{"$f":"V53*0.7","v":23.353948800000001},{"$f":"W53","v":23.353948800000001},{"$f":"0.85*Z53","v":47.838000000000001},56.28,4.2210000000000001]
["00X4020E026","4020",26,"Xflux",80,"E Core",9.84,98.4,42.85,21.1,15.4,14.9,30.35,11.9,5.94,9.27,1.83,183,18,18000,{"$f":"2*L54*P54","v":276.24599999999998},2.7624599999999999,1.94,2.0699999999999998,25.9,29.8,1.9500000000000011]
["00X4020E040",4020,40,"Xflux",108,"E Core",9.84,98.4,42.85,21.1,15.4,14.9,30.35,11.9,5.94,9.27,1.83,183,18,18000,{"$f":"2*L55*P55","v":276.24599999999998},2.7624599999999999,1.94,2.0699999999999998,25.9,29.8,1.9500000000000011]
["00X4020E060",4020,60,"Xflux",150,"E Core",9.84,98.4,42.85,21.1,15.4,14.9,30.35,11.9,5.94,9.27,1.83,183,18,18000,{"$f":"2*L56*P56","v":276.24599999999998},{"$f":"0.01*U56","v":2.7624599999999999},1.94,2.0699999999999998,25.9,{"$f":"2*L56","v":29.8},{"$f":"0.5*(Z56-Y56)","v":1.9500000000000011}]
["00X4022E026",4022,26,"Xflux",104,"E Core",9.84,98.4,42.85,21.1,20,14.9,30.35,11.9,5.94,9.27,2.37,237,23.3,23300,{"$f":"2*L57*P57","v":276.24599999999998},2.7624599999999999,1.94,{"$f":"W57","v":1.94},26,29.8,1.9000000000000004]
["00X4022E040",4022,40,"Xflux",140,"E Core",9.84,98.4,42.85,21.1,20,14.9,30.35,11.9,5.94,9.27,2.37,237,23.3,23300,276.24599999999998,2.7624599999999999,1.94,{"$f":"W58","v":1.94},26,29.8,1.9000000000000004]
["00X4022E060",4022,60,"Xflux",194,"E Core",9.84,98.4,42.85,21.1,20,14.9,30.35,11.9,5.94,9.27,2.37,237,23.3,23300,{"$f":"2*L59*P59","v":276.24599999999998},{"$f":"0.01*U59","v":2.7624599999999999},1.94,{"$f":"W59","v":1.94},26,{"$f":"2*L59","v":29.8},{"$f":"0.5*(Z59-Y59)","v":1.9000000000000004}]
["00X4317E026",4317,26,"Xflux",88,"E Core",7.75,77.5,40.869999999999997,16.5,12.5,10.3,28.32,12.5,6.05,7.87,1.52,152,11.8,11800,162.12200000000001,1.6212200000000001,1.01,1.26,18.11,20.6,1.245000000000001]
["00X4317E040",4317,40,"Xflux",119,"E Core",7.75,77.5,40.869999999999997,16.5,12.5,10.3,28.32,12.5,6.05,7.87,1.52,152,11.8,11800,162.12200000000001,1.6212200000000001,1.01,1.26,18.11,20.6,1.245000000000001]
["00X4317E060",4317,60,"Xflux",163,"E Core",7.75,77.5,40.869999999999997,16.5,12.5,10.3,28.32,12.5,6.05,7.87,1.52,152,11.8,11800,{"$f":"2*L62*P62","v":162.12200000000001},{"$f":"0.01*U62","v":1.6212200000000001},1.01,1.26,18.11,{"$f":"2*L62","v":20.6},{"$f":"0.5*(Z62-Y62)","v":1.245000000000001}]
["00X5528E026",5528,26,"Xflux",116,"E Core",12.3,123,54.86,27.56,20.6,18.5,37.49,16.8,8.3800000000000008,10.199999999999999,3.5,350,43.1,43100,377.4,3.774,3.02,3.02,33.4,37,1.8000000000000007]
["00X5528E040",5528,40,"Xflux",157,"E Core",12.3,123,54.86,27.56,20.6,18.5,37.49,16.8,8.3800000000000008,10.199999999999999,3.5,350,43.1,43100,377.4,3.774,3.02,3.02,33.4,37,1.8000000000000007]
["00X5528E060",5528,60,"Xflux",219,"E Core",12.3,123,54.86,27.56,20.6,18.5,37.49,16.8,8.3800000000000008,10.199999999999999,3.5,350,43.1,43100,{"$f":"2*L65*P65","v":377.4},{"$f":"0.01*U65","v":3.774},3.02,3.02,33.4,{"$f":"2*L65","v":37},{"$f":"0.5*(Z65-Y65)","v":1.8000000000000007}]
["00X5530E026",5530,26,"Xflux",138,"E Core",12.3,123,54.86,27.56,24.6,18.5,37.49,16.8,8.3800000000000008,10.199999999999999,4.17,417,51.3,51300,377.4,3.774,2.89,{"$f":"W66","v":2.89},33.4,37,1.8000000000000007]
["00X5530E040",5530,40,"Xflux",187,"E Core",12.3,123,54.86,27.56,24.6,18.5,37.49,16.8,8.3800000000000008,10.199999999999999,4.17,417,51.3,51300,377.4,3.774,2.89,{"$f":"W67","v":2.89},33.4,37,1.8000000000000007]
["00X5530E060",5530,60,"Xflux",261,"E Core",12.3,123,54.86,27.56,24.6,18.5,37.49,16.8,8.3800000000000008,10.199999999999999,4.17,417,51.3,51300,{"$f":"2*L68*P68","v":377.4},{"$f":"0.01*U68","v":3.774},2.89,{"$f":"W68","v":2.89},33.4,{"$f":"2*L68","v":37},{"$f":"0.5*(Z68-Y68)","v":1.8000000000000007}]
["00X6527E026",6527,26,"Xflux",162,"E Core",14.7,147,65.150000000000006,32.51,27,22.1,44.19,19.7,10,12,5.4,540,79.400000000000006,79400,530.40000000000009,5.3040000000000012,{"$f":"X69","v":4.54},4.54,39.5,44.2,2.3500000000000014]
["00X6527E040",6527,40,"Xflux",230,"E Core",14.7,147,65.150000000000006,32.51,27,22.1,44.19,19.7,10,12,5.4,540,79.400000000000006,79400,530.40000000000009,5.3040000000000012,4.54,4.54,39.5,44.2,2.3500000000000014]
["00X6527E060",6527,60,"Xflux",300,"E Core",14.7,147,65.150000000000006,32.51,27,22.1,44.19,19.7,10,12,5.4,540,79.400000000000006,79400,{"$f":"2*L71*P71","v":530.40000000000009},{"$f":"0.01*U71","v":5.3040000000000012},{"$f":"X71","v":4.54},4.54,39.5,{"$f":"2*L71","v":44.2},{"$f":"0.5*(Z71-Y71)","v":2.3500000000000014}]
["00X7228E026",7228,26,"Xflux",130,"E Core",13.7,137,72.39,27.94,19.100000000000001,17.7,52.62,19.100000000000001,9.5299999999999994,16.8,3.68,368,50.4,50400,594.72,5.9472000000000005,4.08,4.08,30.4,35.4,2.5]
["00X7228E040",7228,40,"Xflux",173,"E Core",13.7,137,72.39,27.94,19.100000000000001,17.7,52.62,19.100000000000001,9.5299999999999994,16.8,3.68,368,50.4,50400,{"$f":"2*L73*P73","v":594.72},{"$f":"0.01*U73","v":5.9472000000000005},4.08,4.08,30.4,{"$f":"2*L73","v":35.4},{"$f":"0.5*(Z73-Y73)","v":2.5}]
["00X7228E060",7228,60,"Xflux",235,"E Core",13.7,137,72.39,27.94,19.100000000000001,17.7,52.62,19.100000000000001,9.5299999999999994,16.8,3.68,368,50.4,50400,594.72,5.9472000000000005,{"$f":"X74","v":4.08},4.08,30.4,{"$f":"2*L74","v":35.4},{"$f":"0.5*(Z74-Y74)","v":2.5}]
["00X8020E026",8020,26,"Xflux",103,"E Core",18.5,185,80.010000000000005,38.1,19.8,28.01,59.28,19.8,9.91,19.8,3.89,389,72,72000,1109.1960000000001,11.091960000000002,8.06,8.06,51,56.02,2.5100000000000016]
["00X8020E040",8020,40,"Xflux",145,"E Core",18.5,185,80.010000000000005,38.1,19.8,28.01,59.28,19.8,9.91,19.8,3.89,389,72,72000,1109.1960000000001,11.091960000000002,8.06,8.06,51,56.02,2.5100000000000016]
["00X8020E060",8020,60,"Xflux",190,"E Core",18.5,185,80.010000000000005,38.1,19.8,28.01,59.28,19.8,9.91,19.8,3.89,389,72,72000,1109.1960000000001,11.091960000000002,{"$f":"X77","v":8.06},8.06,51,{"$f":"2*L77","v":56.02},{"$f":"0.5*(Z77-Y77)","v":2.5100000000000016}]
["00X8024E060",8024,26,"Xflux",370,"E Core",13.14,131.4,80.010000000000005,24.05,29.72,14.02,59.28,19.8,9.91,19.8,6,600,78.8,78840,555.19200000000001,5.55192,{"$f":"V78*0.7","v":3.8863439999999998},{"$f":"W78","v":3.8863439999999998},{"$f":"0.85*Z78","v":23.834},{"$f":"2*L78","v":28.04},2.1029999999999998]
["00X8044E026",8044,26,"Xflux",91,"E Core",20.8,208,80.010000000000005,44.58,19.8,34.36,59.28,19.8,9.91,19.8,3.89,389,80.900000000000006,80900,1360.6559999999999,13.60656,{"$f":"V79*0.7","v":9.5245920000000002},{"$f":"W79","v":9.5245920000000002},{"$f":"0.85*Z79","v":58.411999999999999},68.72,5.1539999999999999]
["00K114LE060","114LE",60,"Kool Mu",445,"E Core",21.5,215,114.3,46.18,34.93,28.6,79.5,35.1,17.2,22.1,12.2,1220,262,262000,1264.1200000000001,12.641200000000001,{"$f":"V80*0.7","v":8.8488400000000009},{"$f":"V80*0.7","v":8.8488400000000009},53.09,57.2,1.65]
["00K114LE026","114LE",26,"Kool Mu",235,"E Core",21.5,215,114.3,46.18,34.93,28.6,79.5,35.1,17.2,22.1,12.2,1220,262,262000,1264.1200000000001,12.641200000000001,{"$f":"V81*0.7","v":8.8488400000000009},{"$f":"V81*0.7","v":8.8488400000000009},53.09,57.2,1.65]
["00K114LE026HT26","114LE",26,"Kool Mu",182,"E Core",21.5,215,114.3,46.18,26.19,28.6,79.5,35.1,17.2,22.1,9.14,914,197,197000,1264.1200000000001,12.641200000000001,{"$f":"V82*0.7","v":8.8488400000000009},{"$f":"V82*0.7","v":8.8488400000000009},53.09,57.2,1.65]
["00X1808E026","1808",26,"Xflux",26,"E Core",4.01,40.099999999999994,19.3,8.1,4.78,5.53,13.9,4.78,2.39,4.6399999999999997,0.22800000000000001,22.8,0.91400000000000003,914,{"$f":"2*L83*P83","v":51.318399999999997},{"$f":"0.01*U83","v":0.51318399999999997},0.316,0.34200000000000003,9.3000000000000007,{"$f":"2*L83","v":11.06},{"$f":"0.5*(Z83-Y83)","v":0.87999999999999989}]
["00X1808E040","1808",40,"Xflux",35,"E Core",4.01,40.099999999999994,19.3,8.1,4.78,5.53,13.9,4.78,2.39,4.6399999999999997,0.22800000000000001,22.8,0.91400000000000003,914,{"$f":"2*L84*P84","v":51.318399999999997},{"$f":"0.01*U84","v":0.51318399999999997},0.316,0.34200000000000003,9.3000000000000007,{"$f":"2*L84","v":11.06},{"$f":"0.5*(Z84-Y84)","v":0.87999999999999989}]
["00X1808E060","1808",60,"Xflux",48,"E Core",4.01,40.099999999999994,19.3,8.1,4.78,5.53,13.9,4.78,2.39,4.6399999999999997,0.22800000000000001,22.8,0.91400000000000003,914,51.318399999999997,0.51318399999999997,0.316,0.34200000000000003,9.3000000000000007,11.06,0.87999999999999989]
["00X3515E026","3515",26,"Xflux",56,"E Core",6.94,69.400000000000006,34.54,14.2,9.35,9.6,25.2,9.32,4.45,7.87,0.84,84,5.83,5830,151.10399999999998,1.5110399999999999,0.94799999999999995,1.1299999999999999,16.59,19.2,1.3049999999999997]
["00X3515E040","3515",40,"Xflux",75,"E Core",6.94,69.400000000000006,34.54,14.2,9.35,9.6,25.2,9.32,4.45,7.87,0.84,84,5.83,5830,151.10399999999998,1.5110399999999999,0.94799999999999995,1.1299999999999999,16.59,19.2,1.3049999999999997]
["00X3515E060","3515",60,"Xflux",102,"E Core",6.94,69.400000000000006,34.54,14.2,9.35,9.6,25.2,9.32,4.45,7.87,0.84,84,5.83,5830,151.10399999999998,1.5110399999999999,0.94799999999999995,1.1299999999999999,16.59,19.2,1.3049999999999997]
["00X4017E026","4017",26,"Xflux",56,"E Core",9.84,98.4,42.85,21.1,10.8,14.9,30.35,11.9,5.94,9.27,1.28,128,12.6,12600,276.24599999999998,2.7624599999999999,{"$f":"V89*0.7","v":1.9337219999999997},{"$f":"V89*0.7","v":1.9337219999999997},{"$f":"0.85*Z89","v":25.33},29.8,2.2350000000000012]
["00X4017E040","4017",40,"Xflux",76,"E Core",9.84,98.4,42.85,21.1,10.8,14.9,30.35,11.9,5.94,9.27,1.28,128,12.6,12600,276.24599999999998,2.7624599999999999,1.9337219999999997,{"$f":"V90*0.7","v":1.9337219999999997},25.33,29.8,2.2350000000000012]
["00X4017E060","4017",60,"Xflux",105,"E Core",9.84,98.4,42.85,21.1,10.8,14.9,30.35,11.9,5.94,9.27,1.28,128,12.6,12600,276.24599999999998,2.7624599999999999,1.9337219999999997,{"$f":"V91*0.7","v":1.9337219999999997},25.33,29.8,2.2350000000000012]
["00K8044E040","8044",40,"Kool Mu",113,"E Core",20.8,208,80.010000000000005,44.58,19.8,34.36,59.28,19.8,9.91,19.8,3.89,389,80.900000000000006,80900,1360.6559999999999,13.60656,9.5245920000000002,{"$f":"W92","v":9.5245920000000002},58.411999999999999,68.72,5.1539999999999999]
["00K8044E060","8044",60,"Kool Mu",170,"E Core",20.8,208,80.010000000000005,44.58,19.8,34.36,59.28,19.8,9.91,19.8,3.89,389,80.900000000000006,80900,1360.6559999999999,13.60656,9.5245920000000002,{"$f":"W93","v":9.5245920000000002},58.411999999999999,68.72,5.1539999999999999]
["00X8044E040","8044",40,"Kool Mu",113,"E Core",20.8,208,80.010000000000005,44.58,19.8,34.36,59.28,19.8,9.91,19.8,3.89,389,80.900000000000006,80900,1360.6559999999999,13.60656,9.5245920000000002,{"$f":"W94","v":9.5245920000000002},58.411999999999999,68.72,5.1539999999999999]
["00X8044E060","8044",60,"Kool Mu",170,"E Core",20.8,208,80.010000000000005,44.58,19.8,34.36,59.28,19.8,9.91,19.8,3.89,389,80.900000000000006,80900,1360.6559999999999,13.60656,9.5245920000000002,{"$f":"W95","v":9.5245920000000002},58.411999999999999,68.72,5.1539999999999999]

{"sheet":"Shape Core Weight","index":25,"n_rows":117,"n_cols":5,"rows_kept":117,"cut":false,"hidden":true,"merged":[]}
["Part Number","Perm","Weight Ration","Spec sheet weight (grams)"]
["00K1808E090",90,0.97,2.95,{"$f":"D3/C3*C2","v":2.9409574468085111}]
["00K1808E060",60,0.94,2.85]
["00K1808E040",40,0.9,2.74,{"$f":"$D$3/$C$3*C4","v":2.7287234042553195}]
["00K1808E026",26,0.86,2.61,{"$f":"$D$3/$C$3*C5","v":2.6074468085106388}]
["00K2510E090",90,0.97,7.62]
["00K2510E060",60,0.94,7.39]
["00K2510E040",40,0.9,7.07]
["00K2510E026",26,0.86,6.75]
["00K3007E090",90,0.97,13.6]
["00K3007E060",60,0.94,12.9]
["00K3007E040",40,0.9,11.7]
["00K3007E026",26,0.86,11.3]
["00K3515E090",90,0.97,17.3]
["00K3515E060",60,0.94,16.7]
["00K3515E040",40,0.9,16]
["00K3515E026",26,0.86,15.6]
["00K4017E090",90,0.97,35.1]
["00K4017E060",60,0.94,34]
["00K4017E0040",40,0.9,32.6]
["00K4017E026",26,0.86,31.1]
["00K4317E090",90,0.97,{"$f":"D25/C25*C22","v":37.333720930232559}]
["00K4317E060",60,0.94,{"$f":"D25/C25*C23","v":36.17906976744186}]
["00K4317E040",40,0.9,33.200000000000003]
["00K4317E026",26,0.86,33.1]
["00K4020E090",90,0.97,53.7]
["00K4020E060",60,0.94,49.9]
["00K4020E040",40,0.9,49.6]
["00K4020E026",26,0.86,48]
["00K4022E090",90,0.97,69]
["00K4022E060",60,0.94,64.8]
["00K4022E040",40,0.9,64.5]
["00K4022E026",26,0.86,63.3]
[]
["00K5528E060",60,0.94,{"$f":"D37/C37*C35","v":126.6813953488372}]
["00K5528E040",40,0.9,120.2]
["00K5528E026",26,0.86,115.9]
[]
["00K5530E060",60,0.94,{"$f":"D41/C41*C39","v":152.69534883720928}]
["00K5530E040",40,0.9,142]
["00K5530E026",26,0.86,139.69999999999999]
[]
["00K6527E060",60,0.94,{"$f":"D45/C45*C43","v":233.14186046511628}]
["00K6527E040",40,0.9,226.3]
["00K6527E026",26,0.86,213.3]
[]
["00K7228E060",60,0.94,156]
["00K7228E040",40,0.9,149.6]
["00K7228E026",26,0.86,143]
[]
["00K8020E060",60,0.94,{"$f":"D53/C53*C51","v":215.32558139534885}]
["00K8020E040",40,0.9,203]
["00K8020E026",26,0.86,197]
[]
[]
[]
["00K8044E026",26,0.86,222]
["00K114LE026",26,null,690]
["00K114LE060",60,null,720]
["00K3112U090",90,0.97,20.08266858268]
["00K3112U060",60,0.94,19.46155512136]
["00K3112U040",40,0.9,18.6334038396]
[]
["00K4110U090",90,0.97,20.016711935]
["00K4110U060",60,0.94,19.397638369999999]
["00K4110U040",40,0.9,18.572206949999998]
[]
["00K4111U090",90,0.97,25.351701265000006]
["00K4111U060",60,0.94,24.567628030000009]
["00K4111U040",40,0.9,23.522197050000006]
["00K4119U090",90,0.97,40.012419975]
["00K4119U060",60,0.94,38.774922449999998]
["00K4119U040",40,0.9,37.124925750000003]
[null,null,null,82.397640439839975]
["00K5527U026",26,0.86,73.053578121919983]
[null,null,null,117.90379240067998]
["00K5529U026",26,0.86,104.53325924183997]
[]
["00K6527U026",26,0.86,142.59993877799997]
[]
["00K6533U026",26,0.86,126.12094424929997]
[]
["00K7236U026",26,0.86,159.89527071540002]
[]
["00K8020U026",26,0.86,126.93100430472002]
[]
["00K8038U026",26,0.86,210.10765006000005]
["00K4741B014",14,0.8,260]
["00K4741B026",26,0.86,280]
["00K4741B040",40,0.9,290]
["00K4741B060",60,0.94,300]
["00K5030B014",14,0.8]
["00K5030B026",26,0.86]
["00K5030B040",40,0.9]
["00K5030B060",60,0.94]
["00K5528B014",14,0.8,{"$f":"D97/C97*C96","v":158.13953488372096}]
["00K5528B026",26,0.86,170]
["00K5528B040",40,0.9,180]
["00K5528B060",60,0.94,190]
["00K6030B014",14,0.8,{"$f":"$D$101/$C$101*C100","v":130.23255813953489}]
["00K6030B026",26,0.86,140]
["00K6030B040",40,0.9,{"$f":"$D$101/$C$101*C102","v":146.51162790697674}]
["00K6030B060",60,0.94,{"$f":"$D$101/$C$101*C103","v":153.02325581395348}]
["00K8030B014",14,0.8,{"$f":"$D$105/$C$105*C104","v":223.25581395348837}]
["00K8030B026",26,0.86,240]
["00K8030B040",40,0.9,{"$f":"$D$105/$C$105*C106","v":251.16279069767441}]
["00K8030B060",60,0.94,{"$f":"$D$105/$C$105*C107","v":262.32558139534882}]
["00X4741B026",26,null,328]
["00X4741B040",40,null,336]
["00X5528B026",26,null,190]
["00X5528B040",40,null,196]
["00X5030B026",26,null,139]
["00X5030B040",40,null,143]
["00X6030B026",26,null,165]
["00X6030B040",40,null,170]
["00X8030B026",26,null,299]
["00X8030B040",40,null,307]

{"sheet":"Wire Resistivity","index":26,"n_rows":9,"n_cols":3,"rows_kept":9,"cut":false,"hidden":true,"merged":[[1,0,1,1],[2,0,2,1],[3,0,3,1]]}
["Type of Wire",null,"Resistivity"]
["Copper",null,10.371]
["Aluminum",null,17]
["Litz"]
[]
[]
["Temperature Coefficient of resistance"]
["Copper",null,4.0410000000000003E-3]
["Aluminum",null,4.3080000000000002E-3]

{"sheet":"Powder Core Toroid OD","index":27,"n_rows":39,"n_cols":2,"rows_kept":39,"cut":false,"hidden":true,"merged":[]}
["Base Part Number"]
[140,3.56]
[150,3.94]
[180,4.6500000000000004]
[20,6.35]
[240,6.6]
[270,6.6]
[410,6.86]
[30,7.87]
[280,9.65]
[290,9.65]
[40,10.199999999999999]
[130,11.2]
[50,12.7]
[120,16.600000000000001]
[380,17.3]
[206,20.3]
[310,22.9]
[350,23.6]
[930,26.9]
[548,32.799999999999997]
[585,34.299999999999997]
[324,35.799999999999997]
[254,39.9]
[438,46.7]
[89,46.7]
[715,50.8]
[195,57.2]
[109,57.2]
[620,62]
[740,74.099999999999994]
[866,77.8]
[906,77.8]
[102,101.6]
[337,132.6]
[165,165.1]
[725,50.55]
[70,68]
[778,77.8]

{"sheet":"LI_KM_E","index":28,"n_rows":17,"n_cols":10,"rows_kept":17,"cut":false,"hidden":true,"merged":[]}
[null,"Size Code","LI^2 max %ui=0.5min","90u","60u","40u","26u","Perm, LI^2 max, %ui=0.5 min","%ui limit","P/N, pg"]
[null,"1808E",0.36343583582508049,0.36343583582508049,0.28455779783195789,0.21943347237259264,0.16933077555825912,90,0.78181493321105566,"K1808E090, pg 4-???37-2"]
[null,"2510E",1.0891302217611176,1.0891302217611176,0.88735676092014482,0.71013934197528361,0.55913076007869078,90,0.72697081101360439,"K2510E090, pg 4-???37-3"]
[null,"3007E",2.4542112943918721,2.4542112943918721,2.2918301075185536,1.635659066733379,1.2470459574290669,90,0.66743908752103254,"K3007E090, pg 4-???37-4"]
[null,"3515E",6.1630987222195035,6.1630987222195035,5.5721416254383156,4.6993848824752851,3.810468909671509,90,0.57394053505654063,"K3515E090, pg 4-???37-5"]
[null,"4317E",12.294420519549927,12.294420519549927,11.077790576805731,9.27352531753791,7.4460326417917324,90,0.57455106317182192,"K4317E090, pg 4-???37-9"]
[null,"4020E",24.314947152387852,22.436913977296069,24.314947152387852,21.307599225610396,17.684145530431628,60,0.65677845328696949,"K4020E060, pg 4-???37-7"]
[null,"4017E",25.001807265529607,15.612783458855791,25.001807265529607,24.25382040483785,21.103252045433869,60,0.53489683556190359,"K4017E060, pg 4-???37-6"]
[null,"4022E",29.05425266184422,29.05425266184422,28.616421349451734,24.710461231006338,20.383272005929978,90,"Set to 0.5","K4022E090, pg 4-???37-8"]
[null,"5528E",68.51411433959511,0,68.51411433959511,62.631932685709032,53.15485178378281,60,0.59552440508651583,"K5528E060, pg 4-???37-10"]
[null,"5530E",77.047645649589512,0,77.047645649589512,69.402557855637468,58.383350498900626,60,0.61362168120245619,"K5530E060, pg 4-???37-11"]
[null,"7228E",116.00321364217815,0,115.69104727483615,116.00321364217815,104.15974373862895,40,0.69932830736782237,"K7228E040, pg 4-???37-13"]
[null,"6527E",187.5071198482128,0,173.32241801409378,187.5071198482128,159.18576223933019,40,0.68668211775413301,"K6527E040, pg 4-???37-12"]
[null,"8020E",296.69976233703119,0,173.85847775481645,296.69976233703119,282.4323432535424,40,0.54683540985322687,"K8020E040, pg 4-???37-14"]
[null,"8044E",574.00734708230038,0,0,0,574.00734708230038,26,0.55872422803823385,"K8044E026, pg 4-???37-15"]
[null,"130LE",2042.0117661750298,0,0,0,2042.0117661750298,26,"Set to 0.5","K130LE026, pg 4-???37-16"]
[null,"160LE",2248.71332349156,0,0,0,2248.71332349156,26,"Set to 0.5","K160LE026, pg 4-???37-17"]

{"sheet":"LI_MPP","index":29,"n_rows":38,"n_cols":17,"rows_kept":38,"cut":false,"hidden":true,"merged":[]}
[null,"Size Code","LI^2 max (%ui=0.5min)","550u","300u","200u","173u","160u","147u","125u","60u","26u","14u","LI^2 min (%ui=0.5min)","P/N, page","%ui win limit","%ui limit"]
[null,"140",{"$f":"MAX(D2:M2)","v":4.7915668322947615E-4},0,4.7915668322947615E-4,3.3228777609275637E-4,2.8546195029882979E-4,2.6163798254111564E-4,2.4587969922400433E-4,2.0622793828624833E-4,0,0,0,2.0723278962311875E-4,"55135 (300µ), pg 4-1",0.98221417343750006,0.98221417343750006]
[null,"150",{"$f":"MAX(D3:M3)","v":1.8811111004236785E-3},0,1.8811111004236785E-3,1.3229813934554574E-3,1.1404024693881722E-3,1.0690957928845971E-3,9.7526076655662822E-4,8.3308669116585906E-4,0,0,0,8.3884922781061219E-4,"55145 (300µ), pg 4-2",0.94989164031999995,0.94989164031999995]
[null,"180",1.9720432295011396E-3,0,1.9720432295011396E-3,1.3836859244468881E-3,1.1814603550289852E-3,1.0984205896344026E-3,1.0162521028108688E-3,8.7128493316595223E-4,4.1678085470978174E-4,0,0,4.1873188351979751E-4,"55175 (300µ), pg 4-3",0.9687837557575002,0.9687837557575002]
[null,"020",4.832132841754485E-3,3.9669811540688407E-3,4.832132841754485E-3,3.3709399008753972E-3,2.9211181523304012E-3,2.7092268601491558E-3,2.5000193005883429E-3,2.1196094812492316E-3,1.0233097926344008E-3,4.2673282705262412E-4,2.5606118965115174E-4,2.5614770947628027E-4,"55015 (300µ), pg 4-4",0.95875264512000002,0.95875264512000002]
[null,"240",5.2502070719570235E-3,4.3765136133395071E-3,5.2502070719570235E-3,3.6344185064913644E-3,3.1844670344234735E-3,2.9294760428092495E-3,2.7198614720668601E-3,2.2959111132900699E-3,1.1118461528349228E-3,4.7078671521771828E-4,2.5681431039060218E-4,2.5690108468566714E-4,"55235 (300µ), pg 4-5",0.95875264512000002,0.95875264512000002]
[null,"270",8.8338926965806936E-3,8.427501420728142E-3,8.8338926965806936E-3,6.1401184498420403E-3,5.3803705927932795E-3,4.9314835616136041E-3,4.5616169372245221E-3,3.8524252007414439E-3,1.879500682230005E-3,7.8995023329868764E-4,4.5143240173506019E-4,4.5153825927008264E-4,"55265 (300µ), pg 4-6",0.96491544843749988,0.96491544843749988]
[null,"030",2.2336715474129992E-2,7.1427056018986725E-3,2.2336715474129992E-2,1.7057013988496572E-2,1.5240919074379779E-2,1.379465107594278E-2,1.3014203347466514E-2,1.0956602056278223E-2,5.3677319706652155E-3,2.3689901602653878E-3,1.2925878097279383E-3,1.2944106738078534E-3,"55025 (300µ), pg 4-8",0.86406574252000001,0.86406574252000001]
[null,"410",2.9499858956210129E-2,0,2.9499858956210129E-2,2.328076869026445E-2,2.01337981606746E-2,1.8894052348078449E-2,1.7290447258968073E-2,1.5019842908692474E-2,7.2461486180776689E-3,3.085850607186072E-3,1.7640508922511565E-3,1.766938537799664E-3,"55405 (300µ), pg 4-7",0.83670787499999999,0.83670787499999999]
[null,"280",4.9399864297784792E-2,1.0733025919399225E-2,4.9399864297784792E-2,3.9717226118805654E-2,3.5928459290056593E-2,3.3116599973775578E-2,3.0929658153866918E-2,2.6234793954040405E-2,1.2772542256293951E-2,5.6503636799284628E-3,3.0837890154939091E-3,3.0899910603581376E-3,"55275 (300µ), pg 4-9",0.78580668032000012,0.78580668032000012]
[null,"290",6.1363893932404531E-2,1.3416282399249033E-2,6.1363893932404531E-2,4.9646532648507075E-2,4.4667814252502783E-2,4.0908741144075701E-2,3.8293862476216196E-2,3.2669743414465414E-2,1.634885408805626E-2,7.1913719562725891E-3,3.5977538514095609E-3,3.6049895704178278E-3,"55285 (300µ), pg 4-10",0.78580668032000012,0.78580668032000012]
[null,"040",7.7705081408258603E-2,1.4933956294088748E-2,7.7705081408258603E-2,6.5069288856942895E-2,5.8875930811556815E-2,5.3989929202149484E-2,5.0648927287189456E-2,4.3326424786601897E-2,2.1832995077481956E-2,9.6165870146730035E-3,4.8117683110891945E-3,4.8226496111241071E-3,"55035 (300µ), pg 4-11",0.7477453585199999,0.7477453585199999]
[null,"130",0.12798826761124651,0,0.12787839298319523,0.12798826761124651,0.11880783708033535,0.11072443234222042,0.10513531475254591,9.1139983928729421E-2,4.8503773304670386E-2,2.0846330921255249E-2,1.139041874396224E-2,1.1427717297985689E-2,"55125 (300µ), pg 4-12",0.56007046571999997,0.56007046571999997]
[null,"050",0.23722627566270421,2.4164097228368604E-2,0.20594840545168189,0.23722627566270421,0.22761026817284374,0.21258341660955554,0.20550862278930077,0.180486614796112,9.8163479771412085E-2,4.4725662292843311E-2,2.2425026065093556E-2,2.2510613653149381E-2,"55047 (200µ), pg 4-13",0.72317818726400007,0.72317818726400007]
[null,"120",0.80790061899170773,5.2381134493661739E-2,0.46364436150679356,0.80790061899170773,0.78345169311293594,0.73325577376590845,0.7568275509332586,0.69134504588761092,0.42463376076572784,0.19244361986407182,0.10330471904772415,5.2381134493661739E-2,"55117 (200µ), pg 4-14",0.53040387174400005,0.53040387174400005]
[null,"380",0.76395630017609861,0,0.57910711794596137,0.76395630017609861,0.73686084804949248,0.70655229700552424,0.6840304631193509,0.62017401321442733,0.3496906793024312,0.15976666327263686,8.4406436806786778E-2,8.4755933113945192E-2,"55377 (200µ), pg 4-15",0.66018857226400007,0.66018857226400007]
[null,"206",1.3912476542199665,8.0706172074911556E-2,0.66675705006700581,1.1687664354567686,1.2099672697271187,1.3038484886128527,1.3811946174404992,1.3912476542199665,0.94537019034175196,0.45796114383275172,0.26494037788134073,8.0706172074911556E-2,"55206 (125µ), pg 4-16",0.63614701495697601,0.63614701495697601]
[null,"310",2.5527416896767301,0.12393172930786767,1.0963881080586375,1.9159945894103254,1.9393430038765789,2.1386330240083611,2.2980019593759295,2.5527416896767301,1.8791356129542212,0.94426951358950917,0.50495447091286294,0.12393172930786767,"55310 (125µ), pg 4-17",0.57564726295591095,0.57564726295591095]
[null,"350",3.2671384198395303,0,1.3810824951077507,2.418282456166271,2.4556944731595287,2.6999811446417961,2.891044316104904,3.2671384198395303,2.4774963537123496,1.2225207237243114,0.67806561168927848,0.68117446114999114,"55350 (125µ), pg 4-18",0.56343948689437484,0.56343948689437484]
[null,"930",5.5282088599659112,0.29046939246112458,2.4001216153401441,4.1887731448445011,4.2567094668611798,4.6883045838814983,5.0303429030387159,5.5282088599659112,4.0419803434436101,1.9556283574389368,1.1172461502375546,0.29046939246112458,"55930 (125µ), pg 4-19",0.58178255845583093,0.58178255845583093]
[null,"548",9.5921773866809978,0.3605635522386193,3.1907523408208665,5.5668627777025987,5.6732027201101918,6.2475353882460958,6.7022169290805875,8.3978022451589283,9.5921773866809978,5.8450761938171238,3.0395754048386476,0.3605635522386193,"55071 (60µ), pg 4-20",0.76859556511718752,0.76859556511718752]
[null,"585",9.3398667489975598,0.27136043116383607,2.4029465959632126,4.1771712880832785,4.2475587394086771,4.6799342873908882,5.0235118468605338,6.3151878670078299,9.3398667489975598,6.0522228023381324,3.6378727105184145,0.27136043116383607,"55586 (60µ), pg 4-21",0.65979667351416316,0.65979667351416316]
[null,"324",12.426000907330314,0.40427893077764471,3.5776960430151794,6.2410828568254093,6.3552774148769471,6.9970703917211816,7.5042997199500734,9.4156790810298077,12.426000907330314,7.6186755990806265,4.3484701202870939,0.40427893077764471,"55076 (60µ), pg 4-22",0.71274600499281937,0.71274600499281937]
[null,"254",23.293465322562088,0.69749825052226089,6.1608365995939112,10.779736505956544,10.97521262699688,12.042065008600918,12.928073088951162,16.23351592297789,23.293465322562088,15.12458326095131,8.7322489954733022,0.69749825052226089,"55083 (60µ), pg 4-23",0.67696260192535529,0.67696260192535529]
[null,"438",41.919144891995778,0,12.274757095673978,21.482595195856863,21.884669615155175,24.020573609736992,25.668525049764789,32.346552132987959,41.919144891995778,25.881181733421627,14.757515346132031,12.274757095673978,"55439 (60µ), pg 4-24",0.72202839696657906,0.72202839696657906]
[null,"089",49.683838244710429,0,9.1186753074579894,15.954013599700199,16.186813443949269,17.838839048470852,19.153896475936232,24.026612519484463,49.683838244710429,31.311907858892141,18.637791656831389,9.1186753074579894,"55090 (60µ), pg 4-25",0.56402748723200002,0.56402748723200002]
[null,"715",50.528560504861062,0,9.3388654676756548,16.297791194163757,16.55552383654307,18.279475461770023,19.560873742250386,24.581790214168141,50.528560504861062,39.322354902570758,23.676829378782209,9.3388654676756548,"55716 (60µ), pg 4-26",0.48882075359575505,"Set to 0.5"]
[null,"195",60.281630984044952,0,0,26.966324073786033,27.364615587624478,30.097926003942,32.241843387893027,44.752266524201374,60.281630984044952,37.854204765144473,21.310756356700786,21.347085430968871,"55192 (60µ), pg 4-27",0.70576635990683856,0.70576635990683856]
[null,725,60.800594817513833,0,0,0,0,0,0,0,60.800594817513833,0,0,12.075027389498358,"55111 (26µ), pg 4-28",0.81373346199999996,0.81373346199999996]
[null,"109",65.507435334001229,0,12.075027389498358,21.158152939466689,21.686795958220543,23.657801373390413,25.510690563392323,31.835361519036539,65.507435334001229,65.268665572434486,42.474325537419148,68.032309114564157,"55617 (60µ), pg 4-29",0.53697564326981129,0.53697564326981129]
[null,"620",167.39560327137468,0,0,0,0,0,0,81.533168271266547,167.39560327137468,114.26617018446805,68.179915737426938,56.401058830637069,"55868 (26µ), pg 4-31",0.69466605254363878,0.69466605254363878]
[null,"866",166.11654229765006,0,0,0,0,0,0,56.401058830637069,115.5984394440423,166.11654229765006,120.58462506100392,71.054748466021195,"55908 (26µ), pg 4-32",0.69572970572093651,0.69572970572093651]
[null,"906",205.40315427206582,0,0,0,0,0,0,71.054748466021195,145.22325794943791,205.40315427206582,150.93030594680394,143.59446133818619,"55735 (26µ), pg 4-30",0.72866026748768986,0.72866026748768986]
[null,778,253.05152697689553,0,0,0,0,0,0,122.5744309036384,253.05152697689553,239.94472557562983,151.94667537940973,136.71420609318255,"55102 (26µ), pg 4-33",0.62940525384123269,0.62940525384123269]
[null,"740",381.14002233016089,0,0,0,0,0,0,143.59446133818619,295.00071726817015,381.14002233016089,272.09680189328117,344.66646593606947,"55336 (14µ), pg 4-34",0.74745557413831942,0.74745557413831942]
[null,"102",449.48167703516208,0,0,0,0,0,0,136.71420609318255,279.95793694436929,449.48167703516208,358.31795539199362,636.93540394378226,"55164 (14µ), pg 4-35",0.58995068420437924,0.58995068420437924]
[null,"337",1566.208097400583,0,0,0,0,0,268.99984430122549,344.66646593606947,708.4421067020678,1441.4363735039994,1566.208097400583]
[null,"165",4013.9616436051579,0,0,0,0,0,0,636.93540394378226,1305.0411192724973,2673.5331816959997,4013.9616436051579]

{"sheet":"PN_MPP","index":30,"n_rows":38,"n_cols":13,"rows_kept":38,"cut":false,"hidden":true,"merged":[]}
[null,"Size Code",null,"550u","300u","200u","173u","160u","147u","125u","60u","26u","14u"]
[null,"140, pg 4-1",null,null,55135,55137,55134,55138,55139,55140]
[null,"150, pg 4-2",null,null,55145,55147,55144,55148,55149,55150]
[null,"180, pg 4-3",null,null,55175,55177,55174,55178,55179,55180,55181]
[null,"020, pg 4-4",null,55016,55015,55017,55014,55018,55019,55020,55021,55022,55023]
[null,"240, pg 4-5",null,55236,55235,55237,55234,55238,55239,55240,55241,55242,55243]
[null,"270, pg 4-6",null,55266,55265,55267,55264,55268,55269,55270,55271,55272,55273]
[null,"030, pg 4-8",null,55026,55025,55027,55024,55028,55029,55030,55031,55032,55033]
[null,"410, pg 4-7",null,null,55405,55407,55404,55408,55409,55410,55411,55412,55413]
[null,"280, pg 4-9",null,55276,55275,55277,55274,55278,55279,55280,55281,55282,55283]
[null,"290, pg 4-10",null,55286,55285,55287,55284,55288,55289,55290,55291,55292,55293]
[null,"040, pg 4-11",null,55036,55035,55037,55034,55038,55039,55040,55041,55042,55043]
[null,"130, pg 4-12",null,null,55125,55127,55124,55128,55129,55130,55131,55132,55133]
[null,"050, pg 4-13",null,55046,55045,55047,55044,55048,55049,55050,55051,55052,55053]
[null,"120, pg 4-14",null,55116,55115,55117,55114,55118,55119,55120,55121,55122,55123]
[null,"380, pg 4-15",null,null,55375,55377,55374,55378,55379,55380,55381,55382,55383]
[null,"206, pg 4-16",null,55202,55201,55203,55200,55204,55205,55206,55848,55208,55209]
[null,"310, pg 4-17",null,55306,55305,55307,55304,55308,55309,55310,55059,55312,55313]
[null,"350, pg 4-18",null,null,55345,55347,55344,55348,55349,55350,55351,55352,55353]
[null,"930, pg 4-19",null,55926,55925,55927,55924,55928,55929,55930,55894,55932,55933]
[null,"548, pg 4-20",null,55544,55543,55545,55542,55546,55547,55548,55071,55550,55551]
[null,"585, pg 4-21",null,55581,55580,55582,55579,55583,55584,55585,55586,55587,55588]
[null,"324, pg 4-22",null,55320,55319,55321,55318,55322,55323,55324,55076,55326,55327]
[null,"254, pg 4-23",null,55250,55249,55251,55248,55252,55253,55254,55083,55256,55257]
[null,"438, pg 4-24",null,null,55433,55435,55432,55436,55437,55438,55439,55440,55441]
[null,"089, pg 4-25",null,null,55084,55086,55082,55087,55088,55089,55090,55091,55092]
[null,"715, pg 4-26",null,null,55710,55712,55709,55713,55714,55715,55716,55717,55718]
[null,"195, pg 4-27",null,null,null,55199,55198,55197,55196,55195,55192,55191,55190]
[null,"725,",null,null,null,null,null,null,null,55725,55726,55727,55728]
[null,"109, pg 4-28",null,null,55104,55106,55103,55107,55108,55109,55110,55111,55112]
[null,"620, pg 4-29",null,null,null,null,null,null,null,55620,55617,55615,55614]
[null,"866, pg 4-31",null,null,null,null,null,null,null,55866,55867,55868,55869]
[null,"906, pg 4-32",null,null,null,null,null,null,null,55906,55907,55908,55909]
[null,"777,",null,null,null,null,null,null,null,55778,55777,55775,55774]
[null,"740, pg 4-30",null,null,null,null,null,null,null,55740,55737,55735,55734]
[null,"102, pg 4-33",null,null,null,null,null,null,null,55098,55099,55102,55101]
[null,"337, pg 4-34",null,null,null,null,null,null,null,55340,55339,55337,55336]
[null,"165, pg 4-35",null,null,null,null,null,null,null,null,55167,55165,55164]

{"sheet":"LI_HF","index":31,"n_rows":39,"n_cols":14,"rows_kept":39,"cut":false,"hidden":true,"merged":[]}
["Catalog page","Size Code","LI^2 max (%ui=0.5min)",550,300,200,173,"160u","147u","125u","60u","40u","26u","14u"]
[1,140,0,0,0,0,0,0,0,0,0,null,0,0]
[2,150,0,0,0,0,0,0,0,0,0,null,0,0]
[3,180,0,0,0,0,0,0,0,0,0,null,0,0]
[4,20,3.3621569212677681E-3,0,0,0,0,2.7362242948342124E-3,2.5031352404587606E-3,3.3621569212677681E-3,1.6254705118394031E-3,null,6.7752517373210618E-4,4.0648469511503138E-4]
[5,240,3.6418092617770004E-3,0,0,0,0,2.9586682597071822E-3,2.7232514158168266E-3,3.6418092617770004E-3,1.7661055802882749E-3,null,7.474696831310738E-4,4.0768023769052812E-4]
[6,270,6.1120346773251835E-3,0,0,0,0,4.9775656147866389E-3,4.5662530423937866E-3,6.1120346773251835E-3,2.9852417265456691E-3,null,1.25419431812167E-3,7.1663444368796154E-4]
[8,"030",2.365938532814266E-2,0,0,0,0,1.4069384809989019E-2,1.3108996605279291E-2,2.365938532814266E-2,1.153406774158899E-2,null,4.9006756814093102E-3,2.7998000771608002E-3]
[7,"410",1.933498506891803E-2,0,0,0,0,1.933498506891803E-2,1.7460246818103601E-2,1.7293419793411143E-2,8.5394256477477164E-3,null,3.7619656607403005E-3,2.0516102830088171E-3]
[9,"280",4.114556297474592E-2,0,0,0,0,3.4129486735153543E-2,3.1407916391201121E-2,4.114556297474592E-2,2.0354047549192317E-2,null,8.9746932748510783E-3,4.8940087818234428E-3]
[10,"290",5.1237870874211895E-2,0,0,0,0,4.2159954202248495E-2,3.8885991722439492E-2,5.1237870874211895E-2,2.6053180862966166E-2,null,1.1422336895265006E-2,5.7096769121273505E-3]
[11,"040",6.7692504641602536E-2,0,0,0,0,5.5978651731663609E-2,5.1686741409923916E-2,6.7692504641602536E-2,3.4826543988702288E-2,null,1.5276268033929931E-2,7.6358472873273211E-3]
[12,"130",0.13863747676744884,0,0,0,0,0.11966513247703492,0.1111494282419838,0.13863747676744884,7.7887316868245793E-2,null,3.3143124750979441E-2,1.8069288690686608E-2]
[13,"050",0.26724997820567659,0,0,0,0,0.23945894070248538,0.22529939165555932,0.26724997820567659,0.15871896247064871,null,7.1171694791761053E-2,3.5564194807017412E-2]
[14,"120",0.94299362344088056,0,0,0,0,0.93585787950211596,0.92939664770579333,0.94299362344088056,0.70317388706441608,null,0.30721647223037685,0.16371610854694746]
[15,"380",0.8962254740819745,0,0,0,0,0.82607594159279074,0.77524764131323598,0.8962254740819745,0.56912656206421874,null,0.25445507230070519,0.13383126339324086]
[16,"206",1.9418340593621972,0,0,0,0,1.9418340593621972,1.9407015781763728,1.7067699631573989,1.6227609294693037,1.0876878210091112,0.734838941998046,0.41957047663384844]
[17,"310",3.6240970060613753,0,0,0,0,3.6019915792454085,3.6240970060613753,2.8031035479987194,3.2940178470071064,2.2807969623164208,1.5199492799225056,0.79941424753125601]
[18,"350",4.677332050943253,0,0,0,0,4.6491542185734342,4.677332050943253,3.517016980205069,4.3629202735187844,2.9895670121609728,1.9692299920130667,1.0734079408823654]
[19,"930",7.8295364262582412,0,0,0,0,7.8065053642378865,7.8295364262582412,6.1330656973665247,7.0693521157918529,4.835903663544185,3.1468010537665605,1.7688134586960924]
[20,"585",18.992356483122116,0,0,0,0,9.5927180371592833,11.038502734858499,8.1523542781729699,18.992356483122116,13.507260788173467,9.606848616036487,4.8076575780788655]
[21,"548",20.757972335504725,0,0,0,0,12.805916007857306,14.727235081073147,6.1306098098161375,20.757972335504725,14.891761540620822,10.193700112426649,5.7552948890727658]
[22,"324",26.088652054503839,0,0,0,0,14.342279021904295,16.48970590835486,9.1404809731482803,26.088652054503839,18.515009878311609,12.670237504601159,6.8778387789283562]
[23,"254",50.816956843684814,0,0,0,0,24.683281242620215,28.407730388457857,15.75904851305215,50.816956843684814,36.758730700739356,25.365209911963909,13.813377133157941]
[24,89,87.147087504754239,0,0,0,0,0,0,31.401138651189903,87.147087504754239,39.42226381483227,42.952807181003386,23.341120782714231]
[25,438,119.74256708571814,0,0,0,0,0,56.403188167793118,23.324371263462215,101.88313758832005,119.74256708571814,54.200744990236892,29.520537710295514]
[26,"715",122.29784043303158,0,0,0,0,0,42.982432386418012,23.863322422619341,122.29784043303158,94.564686221713814,69.887490265918473,37.568761735334412]
[27,725,126.50384567539999,null,null,null,null,null,null,45.677604761046183,126.50384567539999,90.634005453372495,61.982978479767603,33.502968171501315]
[28,"195",127.50722044812584,0,0,0,0,0,0,43.444263249569474,127.50722044812584,91.4838898898265,63.053256643964211,33.707132221900245]
[29,"109",194.1577887309206,0,0,0,0,0,0,30.904888934067646,194.1577887309206,155.16797679942601,121.60365327672568,67.69379505439062]
[30,"620",365.27972988766669,0,0,0,0,0,0,79.15014592686174,365.27972988766669,275.92850002579701,199.56800726494535,108.04891779141602]
[31,70,376.65841284551243,null,null,null,null,null,null,75.45695607120787,376.65841284551243,304.49562991556104,224.87883735987188,122.60768938871722]
[32,"866",455.36045110185069,0,0,0,0,0,0,54.752588811732345,455.36045110185069,391.48709901924224,349.64668653228,195.56401387637081]
[33,"906",571.01218212956019,0,0,0,0,0,0,68.977985636110873,571.01218212956019,497.14146793667851,431.83955242274641,244.72890067242218]
[34,778,734.97151838286777,null,null,null,null,null,null,118.99186918195669,734.97151838286777,577.60244597300573,131.32807022676209,242.01805246363173]
[35,"740",1090.5551473846151,0,0,0,0,0,0,139.39753366866177,1090.5551473846151,924.68257532966277,773.59994050745058,438.62493455331901]
[36,"102",1115.231698411538,0,0,0,0,0,0,132.71837206851077,1115.231698411538,1091.4779508978977,1017.5250720916731,589.48576462543633]
[37,"337",4353.1808060501098,0,0,0,0,0,0,334.59267747540264,2822.1278614458133,3194.3803034715311,4353.1808060501098,2802.1949678449191]
[38,"165",11183.096468850488,0,0,0,0,0,0,618.31928326893501,5198.7210644160805,null,11183.096468850488,8267.9970047165425]

{"sheet":"PN_HF","index":32,"n_rows":39,"n_cols":14,"rows_kept":39,"cut":false,"hidden":true,"merged":[]}
["Catalog page","Size Code",null,550,300,200,173,"160u","147u","125u","60u","40u","26u","14u"]
[1,"140"]
[2,"150"]
[3,"180"]
[4,"020",null,null,null,null,null,"58018","58019","58020","58021",null,"58022","58023"]
[5,"240",null,null,null,null,null,"58238","58239","58240","58241",null,"58242","58243"]
[6,"270",null,null,null,null,null,"58268","58269","58270","58271",null,"58272","58273"]
[7,"410",null,null,null,null,null,"58408","58409","58410","58411",null,"58412","58413"]
[8,"030",null,null,null,null,null,"58028","58029","58030","58031",null,"58032","58033"]
[9,"280",null,null,null,null,null,"58278","58279","58280","58281",null,"58282","58283"]
[10,"290",null,null,null,null,null,"58288","58289","58290","58291",null,"58292","58293"]
[11,"040",null,null,null,null,null,"58038","58039","58040","58041",null,"58042","58043"]
[12,"130",null,null,null,null,null,"58128","58129","58130","58131",null,"58132","58133"]
[13,"050",null,null,null,null,null,"58048","58049","58050","58051",null,"58052","58053"]
[14,"120",null,null,null,null,null,"58118","58119","58120","58121",null,"58122","58123"]
[15,"380",null,null,null,null,null,"58378","58379","58380","58381",null,"58382","58383"]
[16,"206",null,null,null,null,null,"58204","58205","58206","58848",58847,"58208","58209"]
[17,"310",null,null,null,null,null,"58308","58309","58310","58059",58316,"58312","58313"]
[18,"350",null,null,null,null,null,"58348","58349","58350","58351",58356,"58352","58353"]
[19,"930",null,null,null,null,null,"58928","58929","58930","58894",58936,"58932","58933"]
[21,"585",null,null,null,null,null,"58583","58584","58585","58586",58591,"58587","58588"]
[20,"548",null,null,null,null,null,"58546","58547","58548","58071",58555,"58550","58551"]
[22,"324",null,null,null,null,null,"58322","58323","58324","58076",58330,"58326","58327"]
[23,"254",null,null,null,null,null,"58252","58253","58254","58083",58260,"58256","58257"]
[25,"089",null,null,null,null,null,"58087","N/A","58089","58090",58091,"58091","58092"]
[24,"438",null,null,null,null,null,"58436","58437","58438","58439",58431,"58440","58441"]
[27,"715",null,null,null,null,null,"58713","58714","58715","58716",58721,"58717","58718"]
[26,"725",null,null,null,null,null,null,null,58725,"58726",58733,58727,58728]
[28,"195",null,null,null,null,null,"58197",null,"58195","58192",58189,"58191","58190"]
[29,"109",null,null,null,null,null,"58107",null,"58109","58110",58212,"58111","58112"]
[30,"620",null,null,null,null,null,null,null,"58620","58617",58616,"58615","58614"]
[35,"070",null,null,null,null,null,null,null,58070,"58072",58073,58074,58075]
[33,"866",null,null,null,null,null,null,null,"58866","58867",58872,"58868","58869"]
[34,"906",null,null,null,null,null,null,null,"58906","58907",58912,"58908","58909"]
[31,"778",null,null,null,null,null,null,null,58778,"58777",58776,58775,58774]
[32,"740",null,null,null,null,null,null,null,"58740","58737",58736,"58735","58734"]
[36,"102",null,null,null,null,null,null,null,"58098",58099,58100,"58102","58101"]
[37,"337",null,null,null,null,null,null,null,"58340","58339","58338","58337","58336"]
[38,"165",null,null,null,null,null,null,null,"58168","58167",null,"58165","58164"]

{"sheet":"LI_KM","index":33,"n_rows":39,"n_cols":13,"rows_kept":39,"cut":false,"hidden":true,"merged":[]}
[null,"Size Code","LI^2 max %ui=0.5min",173,160,147,"125u","90u","75u","60u","40u","26u","14u"]
[null,"140",{"$f":"MAX(G2:M2)","v":3.1592572928738438E-4},0,0,0,3.1592572928738438E-4,2.3555596482523531E-4,2.0009111669186264E-4,1.6348268922778561E-4,0,0,0]
[null,"150",1.2449535218741002E-3,0,0,0,1.2449535218741002E-3,9.1982029488178361E-4,7.8438726285030695E-4,6.416128760831939E-4,0,0,0]
[null,"180",1.3196144310873106E-3,0,0,0,1.3196144310873106E-3,9.6778388798107067E-4,8.1588132744401468E-4,6.5775804669051304E-4,0,0,0]
[null,"020",3.1866468184687659E-3,0,0,0,3.1866468184687659E-3,2.3653621646619314E-3,1.9979212162268638E-3,1.6130557618899059E-3,0,0,0]
[null,"240",3.4517008483755749E-3,0,0,0,3.4517008483755749E-3,2.570012367486693E-3,2.1373839487208043E-3,1.7526167110630316E-3,0,0,0]
[null,"270",5.8176361702820083E-3,0,0,0,5.8176361702820083E-3,4.2983705631037001E-3,3.6460521635609902E-3,2.964821724015711E-3,0,0,0]
[null,"030",1.5628292473701219E-2,0,0,0,1.5628292473701219E-2,1.1806836882578614E-2,1.0172228787278366E-2,8.3779186877966025E-3,0,0,0]
[null,"410",2.1159779343027894E-2,0,0,0,2.1159779343027894E-2,1.616216148280292E-2,1.4011203662172594E-2,1.1279192194970478E-2,0,0,0]
[null,"280",3.6180380649470233E-2,0,0,0,3.6180380649470233E-2,2.8086840535613465E-2,2.4568050881529455E-2,1.9782253126825786E-2,0,0,0]
[null,"290",4.5054813638962937E-2,0,0,0,4.5054813638962937E-2,3.5478114360774901E-2,3.0710063601911818E-2,2.5321284002337009E-2,0,0,0]
[null,"040",5.8877056651561344E-2,0,0,0,5.8877056651561344E-2,4.6773067350850586E-2,4.0676525157203165E-2,3.368849570368062E-2,0,0,0]
[null,"130",0.1163307100596089,0,0,0,0.1163307100596089,9.4870230463417804E-2,8.526179117950182E-2,7.3400291456763384E-2,0,0,0]
[null,"050",0.22259746193330257,0,0,0,0.22259746193330257,0.18562116463496861,0.17097539302983963,0.14641403515780088,0,0,0]
[null,"380",0.74962837127308313,0,0,0,0.74962837127308313,0.64088771934590028,0.58153663370375852,0.51583657504322311,0,0,0]
[null,"120",0.81473780818198127,0,0,0,0.81473780818198127,0.72312990462904159,0.66911445486467558,0.61276246675819857,0,0,0]
[null,"206",1.5069200222074235,0,0,0,1.4202020244311784,1.5069200222074235,1.448485422125233,1.3262382560189077,0.96815317948994617,0,0]
[null,"310",2.8433030507571324,0,0,0,2.3324603897958753,2.8433030507571324,2.7414188573668317,2.6089001394221407,1.9920274936049351,1.4352659413333821,0]
[null,"350",3.6680071549095499,0,0,0,2.9265072288979801,3.6680071549095499,3.5356157987881822,3.4332300617633855,2.6007897546736043,1.8558459724309186,0]
[null,"930",6.1190823149756826,0,0,0,5.1033194322544428,6.1190823149756826,5.9017432272312149,5.6171187352787291,4.2319407715206916,2.9743874736526958,0]
[null,"585",12.942889750768821,0,0,0,5.1012758900395436,7.105034646680882,8.9499437365356815,12.942889750768821,11.107423347809954,8.7676634953624273,0]
[null,"548",13.072725969320521,0,0,0,6.7835679673686053,9.3828651742684315,11.97123010409066,13.072725969320521,10.78941213578719,8.6384749873594302,0]
[null,"324",17.030236140446107,0,0,0,7.6057874596793047,10.540888832119204,13.419214345030339,17.030236140446107,14.265696650019597,11.139285642344122,0]
[null,"254",32.146162046141647,0,0,0,13.113092616149949,18.231434475666951,23.248125811646176,32.146162046141647,27.703058366364953,21.973945433780699,0]
[null,"089",53.523812431199751,0,0,0,19.408192083292832,26.941059611657519,34.40484326602045,52.856050030189905,53.523812431199751,44.716469526562477,0]
[null,"438",57.37144766192187,0,0,0,26.12886425500761,36.258113649588324,46.341666121772839,57.37144766192187,48.241541934246484,37.905849416828012,0]
[null,"715",64.073706742695407,0,0,0,19.856652944350238,27.48707826241646,35.056986081838595,53.754706084583823,64.073706742695407,55.660813410171244,0]
[null,"195",82.71390799357502,0,0,0,36.149939329152375,50.331009962254448,63.888817431229121,82.71390799357502,70.180454042718637,55.276500251523139,0]
[null,725,83.222118699986353,0,0,0,38.008301149615754,52.722105433564245,67.067514909546361,83.222118699986353,70.208660190113363,54.682801567043832,0]
[null,"109",99.628027212082173,0,0,0,25.71593523229582,35.639809281370226,45.695802120637474,69.68995153533713,99.628027212082173,91.656062724556961,0]
[null,"620",191.8606734742867,0,0,0,65.860777905537702,91.64074221818916,116.82874374928008,178.08347128429807,191.8606734742867,162.62191461839532,101.46764693466478]
[null,"070",205.23775812675211,0,0,0,62.787677357233392,0,0,162.21351516346445,205.23775812675211,178.23004612232222,113.84399241188156]
[null,"866",234.90571438372126,0,0,0,45.559588668539931,0,0,122.97916414130275,179.48711987483878,234.90571438372126,167.19010471235174]
[null,"906",290.40447253447252,0,0,0,57.396530848460472,0,0,154.49546691453287,228.49138067370177,290.40447253447252,209.34068164115587]
[null,"778",372.91844987946138,0,0,0,99.01304636885051,0,null,269.20835109857353,372.91844987946138,337.13420566418881,220.42408655808541]
[null,"740",536.21668428984697,0,0,0,115.99258470116962,161.21384874181828,205.23536734983503,313.83591167150547,461.43393378775573,536.21668428984697,381.75229111429178]
[null,"102",645.81098979223054,null,null,null,110.43485927196799,0,0,297.83268049053652,437.9043323542565,645.81098979223054,486.12430295354551]
[null,"337",1998.8947663106319,null,null,null,0,0,0,753.6746909710472,1104.6235410738002,1808.8313805342577,1998.8947663106319]
[null,"165",4611.8230401828569,null,null,null,0,0,0,0,0,3354.9664798561471,4611.8230401828569]

{"sheet":"PN_KM","index":34,"n_rows":39,"n_cols":13,"rows_kept":39,"cut":false,"hidden":true,"merged":[]}
[null,"Size Code",200,173,160,147,"125u","90u","75u","60u","40u","26u","14u"]
[null,"140",null,null,null,null,77140,77444,77445,77141]
[null,"150",null,null,null,null,77150,77154,77155,77151]
[null,"180",null,null,null,null,77180,77184,77185,77181]
[null,"020",null,null,null,null,77020,77824,77825,77021]
[null,"240",null,null,null,null,77240,77244,77245,77241]
[null,"270",null,null,null,null,77270,77874,77875,77271]
[null,"030",null,null,null,null,77030,77834,77835,77031]
[null,"410",null,null,null,null,77410,77414,77415,77411]
[null,"280",null,null,null,null,77280,77884,77885,77281]
[null,"290",null,null,null,null,77290,77294,77295,77291]
[null,"040",null,null,null,null,77040,77844,77845,77041]
[null,"130",null,null,null,null,77130,77334,77335,77131]
[null,"050",null,null,null,null,77050,77054,77055,77051]
[null,"380",null,null,null,null,77380,77384,77385,77381]
[null,"120",null,null,null,null,77120,77224,77225,77121]
[null,"206",null,null,null,null,77206,77210,77211,77848,77847]
[null,"310",null,null,null,null,77310,77314,77315,77059,77316,77312,77313]
[null,"350",null,null,null,null,77350,77354,77355,77351,77356,77352,77353]
[null,"930",null,null,null,null,77930,77934,77935,77894,77936,77932,77933]
[null,"585",null,null,null,null,77585,77589,77590,77586,77591,77587,77588]
[null,"548",null,null,null,null,77548,77552,77553,77071,77555,77550,77551]
[null,"324",null,null,null,null,77324,77328,77329,77076,77330,77326,77327]
[null,"254",null,null,null,null,77254,77258,77259,77083,77260,77256,77257]
[null,"089",null,null,null,null,77089,77093,77094,77090,77095,77091,77092]
[null,"438",null,null,null,null,77438,77442,77443,77439,77431,77440,77441]
[null,"715",null,null,null,null,77715,77719,77720,77716,77721,77717,77718]
[null,"195",null,null,null,null,77195,77194,77193,77192,77189,77191,77190]
[null,"725",null,null,null,null,77725,77730,77729,77726,77733,77727]
[null,"109",null,null,null,null,77109,77213,77214,77110,77212,77111,77112]
[null,"620",null,null,null,null,null,77619,77618,77617,77616,77615,77614]
[null,"070",null,null,null,null,77070,77068,77069,77072,77073,77074,77075]
[null,"866",null,null,null,null,77866,null,null,77867,77872,77868,77869]
[null,"906",null,null,null,null,77906,null,null,77907,77912,77908,77907]
[null,778,null,null,null,null,77778,null,null,77777,77776,77775,77774]
[null,"740",null,null,null,null,null,77739,77738,77737,77736,77735,77734]
[null,"102",null,null,null,null,77098,null,null,77099,77100,77102,77101]
[null,"337",null,null,null,null,null,null,null,77339,77338,77337,77336]
[null,"165",null,null,null,null,null,null,null,null,77166,77165,77164]

{"sheet":"LI_XF","index":35,"n_rows":38,"n_cols":9,"rows_kept":38,"cut":false,"hidden":true,"merged":[]}
[null,"Size Code","Max","90u","75u","60u","40u","26u","19u"]
[null,"140",0,0]
[null,"150",0,0]
[null,"180",0,0]
[null,"020",0,0]
[null,"240",0,0]
[null,"270",0,0]
[null,"410",0,0]
[null,"030",0,0]
[null,"280",0,0]
[null,"290",0,0]
[null,"040",0,0]
[null,"130",0,0]
[null,"050",0.22650708008008985,0.22650708008008985,0.19791440105239888,0.14641403515780088,0.10616231064419114,7.0979895782891045E-2,5.2216739110057732E-2]
[null,"380",0.80717780025943675,0.80717780025943675,0.69238407365402044,0.51583657504322311,0.3722610464897062,0.25359914826280833,0.18761209681891947]
[null,"120",0.96946225125323515,0.96946225125323515,0.84563691959784171,0.61276246675819857,0.46563528912494195,0.30570199470493442,0.22553941780755496]
[null,"206",2.1948896733826344,2.1948896733826344,2.0014613738351468,1.3262382560189077,1.0803249665108077,0.729181754931437,0.52599359515261346]
[null,"310",4.2827492375030118,4.2827492375030118,3.9439926288091973,2.6089001394221407,2.2626962899629941,1.5060362608780955,1.1230293024155449]
[null,"350",5.5604534452852548,5.5604534452852548,5.1276931469061466,3.4332300617633855,2.9651211008058698,1.9505979273208738,1.4362900816882798]
[null,"930",9.1868953956707298,9.1868953956707298,8.4562824565779326,5.6171187352787291,4.7981074150525789,3.1184773996762361,2.2678010276140919]
[null,"548",21.34673287056988,21.243219685744567,21.34673287056988,13.072725969320521,13.330188148814459,9.4474817922339369,6.9095098526510599]
[null,"585",21.964308526475921,20.818876882299929,21.964308526475921,12.942889750768821,14.648312980659096,9.9593247551678896,7.7365558928561748]
[null,"324",28.641427675704222,27.64593747536453,28.641427675704222,17.030236140446107,18.238644555911563,12.418395655438067,9.5912232344741994]
[null,"254",54.676790363127466,51.662987726124172,54.676790363127466,32.146162046141647,36.173519179752972,24.807651641613607,19.050931665009951]
[null,"438",96.25037748863032,93.026909612240985,96.25037748863032,57.37144766192187,61.333985187566981,42.122492218718179,19.831202160029836]
[null,"089",103.19795975923356,88.748989000308924,103.19795975923356,52.917344502125125,74.464833388141699,52.646572389001904,64.106657558435359]
[null,"715",119.14327758472149,90.547678581516067,119.14327758472149,53.81704268222223,92.808143207371089,67.565568737574068,51.41221339452747]
[null,"195",139.10192579741982,134.13147779798237,139.10192579741982,82.71390799357502,90.099641805945538,61.774094346204571,46.684943894947402]
[null,725,139.6186616022344,135.52057978557644,139.6186616022344,83.222118699986353,89.304373949992424,60.781978740071267,46.079484591812246]
[null,"109",175.97613027512949,117.40432958014728,175.97613027512949,69.77076742634884,152.46054342810265,116.76432814165466,91.475188530810243]
[null,"620",367.53750028756093,301.88208408785152,367.53750028756093,178.28998562516404,270.86045049201942,193.52120952754836,148.89602246196728]
[null,"866",388.65314217963515,208.10378876978356,309.71237641206579,123.12177682084975,388.65314217963515,331.88799338825959,273.28278488843125]
[null,"070",403.43608375896486,287.93251277513099,382.8054427456666,162.40162592367111,403.43608375896486,217.27055864488102,170.11119472912821]
[null,"906",493.47695537361847,262.46051476947616,388.16796553883864,154.67462744687501,493.47695537361847,409.93758203296193,335.76373208025029]
[null,"778",567.38208127271037,null,null,269.52053832617975,567.38208127271037,427.12199176124614,333.93042193211454]
[null,"740",914.4018188951602,531.06916709742723,790.36856922810011,314.19985121048393,914.4018188951602,736.27930752207703,594.04615538543487]
[null,"102",1093.8338583112259,505.50218094062649,0,298.17806189654937,1093.8338583112259,962.23891178752467,806.80128760207333]
[null,"337",5200.0998235867755,0,0,null,3288.2874455938731,4134.5443543513729,5200.0998235867755]

{"sheet":"PN_XF","index":36,"n_rows":39,"n_cols":9,"rows_kept":39,"cut":false,"hidden":true,"merged":[]}
[null,null,"Size Code","90u","75u","60u","40u","26u","19u"]
[null,null,"140"]
[null,null,"150"]
[null,null,"180"]
[null,null,"020"]
[null,null,"240"]
[null,null,"270"]
[null,null,"030"]
[null,null,"410"]
[null,null,"280"]
[null,null,"290"]
[null,null,"040"]
[null,null,"130"]
[null,null,"050",78054,78055,78051,78056,78052,78057]
[null,null,380,78384,78385,78381,78386,78382,78387]
[null,null,120,78224,78225,78121,78113,78122,78226]
[null,null,206,78210,78211,78848,78847,78208,78849]
[null,null,"310",78314,78315,78059,78316,78312,78303]
[null,null,"350",78354,78355,78351,78356,78352,78357]
[null,null,"930",78934,78935,78894,78936,78932,78937]
[null,null,548,78552,78553,78071,78555,78550,78554]
[null,null,585,78589,78590,78586,78591,78587,78592]
[null,null,"324",78328,78329,78076,78330,78326,78317]
[null,null,"254",78258,78259,78083,78260,78256,78262]
[null,null,438,78442,78443,78439,78431,78440,78079]
[null,null,"089",78093,78094,78090,78095,78091,78430]
[null,null,715,78719,78720,78716,78721,78717,78750]
[null,null,"195",78194,78193,78192,78189,78191,78708]
[null,null,725,78730,78729,78726,78733,78727,78188]
[null,null,"109",78213,78214,78110,78212,78111,78215]
[null,null,"620",78619,78618,78617,78616,78615,78772]
[null,null,866,78870,78871,78867,78872,78868,78744]
[null,null,"070",78068,78069,78072,78073,78074,78612]
[null,null,"906",78910,78911,78907,78912,78908,78873]
[null,null,778,null,null,78777,78776,78775,78913]
[null,null,740,78739,78738,78737,78736,78735,78067]
[null,null,"102",78096,78159,78099,78100,78102,78097]
[null,null,"337",null,null,null,78338,78337,78342]
[null,null,"165",null,null,null,null,78165]

{"sheet":"Wire Table","index":37,"n_rows":47,"n_cols":14,"rows_kept":47,"cut":false,"hidden":true,"merged":[[1,5,1,9]]}
[]
["AWG\nWire Size","Cir Mils","Wire\nO.D. (cm)\nHeavy Build","Wire Area    sq. cm\n(x0.001)",null,"Current Capacity, Amps\n(listed by columns of amps/sq.cm.)",null,null,null,null,null,null,"Bare Wire OD (Inches)","Bare Wire Radius (mm)"]
[null,null,null,null,null,200,400,500,600,800,"Feet per Pound","$/pound"]
[6,26240,0.42099999999999999,139.19999999999999,{"$f":"D4*0.001","v":0.13919999999999999},26.596062162869462,53.192124325738924,66.490155407173646,79.788186488608375,106.384248651478,12.5,10.06,0.16200000000000001,{"$f":"M4*25.4*0.5","v":2.0573999999999999}]
[7,20820,0.376,111,{"$f":"D5*0.001","v":0.111},21.101822832865714,42.203645665731429,52.754557082164283,63.305468498597136,84.407291331462858,15.75,10.15,0.14430000000000001,{"$f":"M5*25.4*0.5","v":1.8326100000000001}]
[8,16510,0.33600000000000002,88.7,8.8700000000000001E-2,16.733761143455315,33.467522286910629,41.834402858638285,50.20128343036594,66.935044573821258,19.850000000000001,10.27,0.1285,1.63195]
[9,13090,0.29899999999999999,70.2,7.0199999999999999E-2,13.262926387282855,26.52585277456571,33.157315968207136,39.788779161848566,53.05170554913142,25,10.31,0.1144,1.4528799999999999]
[10,10380,0.26700000000000002,56,5.6000000000000001E-2,10.522905694063136,21.045811388126271,26.307264235157838,31.568717082189405,42.091622776252542,31.5,7.57,0.1019,1.29413]
[11,8226,0.23799999999999999,44.5,4.4499999999999998E-2,8.3368480194415486,16.673696038883097,20.842120048603871,25.010544058324644,33.347392077766195,39,7.58,9.0700000000000003E-2,1.1518900000000001]
[12,6529,0.21299999999999999,35.6,3.56E-2,6.6162214326701747,13.232442865340349,16.540553581675436,19.848664298010522,26.464885730680699,49.9,7.59,8.0799999999999997E-2,1.02616]
[13,5184,0.19020000000000001,28.4,2.8399999999999998E-2,5.2535431432828554,10.507086286565711,13.133857858207138,15.760629429848565,21.014172573131422,62.9,7.6,7.1999999999999995E-2,0.91439999999999988]
[14,4109,0.17150000000000001,23.1,2.3100000000000002E-2,4.1639295143811799,8.3278590287623597,10.40982378595295,12.49178854314354,16.655718057524719,79.180000000000007,7.94,6.4100000000000004E-2,0.81406999999999996]
[15,3260,0.15290000000000001,18.399999999999999,1.84E-2,3.3041482638485449,6.6082965276970898,8.260370659621362,9.9124447915456351,13.21659305539418,99.7,7.98,5.7099999999999998E-2,0.72516999999999998]
[16,2581,0.13689999999999999,14.72,1.472E-2,2.6152591777163332,5.2305183554326664,6.5381479442908335,7.8457775331489996,10.461036710865333,125.6,8.08,5.0799999999999998E-2,0.64515999999999996]
[17,2052,0.12239999999999999,11.77,1.1769999999999999E-2,2.0796187015623682,4.1592374031247363,5.19904675390592,6.2388561046871036,8.3184748062494727,157.69999999999999,8.19,4.53E-2,0.57530999999999999]
[18,1624,0.1095,9.42,9.4199999999999996E-3,1.6458770994549103,3.2917541989098207,4.1146927486372755,4.9376312983647308,6.5835083978196414,199.2,8.3000000000000007,4.0300000000000002E-2,0.51180999999999999]
[19,1289,9.8000000000000004E-2,7.54,7.5399999999999998E-3,1.3060993322712922,2.6121986645425843,3.2652483306782303,3.9182979968138762,5.2243973290851686,250.6,8.3800000000000008,3.5900000000000001E-2,0.45593]
[20,1024,8.7900000000000006E-2,6.07,6.0700000000000007E-3,1.0377369171916757,2.0754738343833514,2.5943422929791891,3.1132107515750267,4.1509476687667028,314.5,8.27,3.2000000000000001E-2,0.40639999999999998]
[21,812.3,7.85E-2,4.84,4.8399999999999997E-3,0.82314629979388532,1.6462925995877706,2.0578657494847135,2.4694388993816561,3.2925851991755413,395.3,8.3699999999999992,2.8500000000000001E-2,0.36194999999999999]
[22,640.1,7.0099999999999996E-2,3.86,3.8600000000000001E-3,0.64867678059103473,1.2973535611820695,1.6216919514775867,1.9460303417731042,2.5947071223641389,502.5,8.5299999999999994,2.53E-2,0.32130999999999998]
[23,510.8,6.3200000000000006E-2,3.14,3.14E-3,0.51761182404767581,1.0352236480953516,1.2940295601191893,1.5528354721430273,2.0704472961907032,625,8.8000000000000007,2.2599999999999999E-2,0.28701999999999994]
[24,404,5.6599999999999998E-2,2.52,2.5200000000000001E-3,0.40942977726036012,0.81885955452072023,1.0235744431509002,1.2282893317810804,1.6377191090414405,790.5,9.01,2.01E-2,0.25527]
[25,320.39999999999998,5.0500000000000003E-2,2,2E-3,0.32470828675525848,0.64941657351051696,0.81177071688814617,0.97412486026577538,1.2988331470210339,992.1,9.32,1.7899999999999999E-2,0.22732999999999998]
[26,252.8,4.5199999999999997E-2,1.6,1.6000000000000001E-3,0.25620143558127684,0.51240287116255367,0.64050358895319215,0.76860430674383062,1.0248057423251073,1254,9.06,1.5900000000000001E-2,0.20193]
[27,201.6,4.0899999999999999E-2,1.31,1.3100000000000002E-3,0.20434499217043892,0.40868998434087783,0.51086248042609728,0.61303497651131678,0.81737996868175566,1571,9,1.4200000000000001E-2,0.18034]
[28,158.80000000000001,3.6600000000000001E-2,1.05,1.0500000000000002E-3,0.16088975876303743,0.32177951752607487,0.40222439690759398,0.48266927628911233,0.64355903505214973,1987,9,1.26E-2,0.16002]
[29,127.7,3.3000000000000002E-2,0.85499999999999998,8.5499999999999997E-4,0.12940295601191895,0.2588059120238379,0.32350739002979734,0.38820886803575683,0.51761182404767581,2463,9,1.1299999999999999E-2,0.14350999999999997]
[30,100,2.9499999999999998E-2,0.68300000000000005,6.8300000000000001E-4,0.10134149581949956,0.20268299163899911,0.2533537395487489,0.30402448745849869,0.40536598327799822,3136,9,0.01,0.127]
[31,79.209999999999994,2.6700000000000002E-2,0.56000000000000005,5.6000000000000006E-4,8.02725988386256E-2,0.1605451976772512,0.20068149709656399,0.24081779651587679,0.3210903953545024,3948,9,8.8999999999999999E-3,0.11302999999999999]
[32,64,2.41E-2,0.45600000000000002,4.5600000000000003E-4,6.4858557324479732E-2,0.12971711464895946,0.16214639331119932,0.19457567197343917,0.25943422929791893,4873,9,8.0000000000000002E-3,0.1016]
[33,50.41,2.1600000000000001E-2,0.36599999999999999,3.6600000000000001E-4,5.1086248042609729E-2,0.10217249608521946,0.12771562010652432,0.15325874412782919,0.20434499217043892,6161,9,7.1000000000000004E-3,9.017E-2]
[34,39.69,1.9050000000000001E-2,0.28499999999999998,2.8499999999999999E-4,4.0222439690759358E-2,8.0444879381518716E-2,0.1005560992268984,0.12066731907227808,0.16088975876303743,7837,9,6.3E-3,8.0009999999999998E-2]
[35,31.36,1.702E-2,0.22800000000000001,2.2800000000000001E-4,3.178069308899506E-2,6.356138617799012E-2,7.945173272248765E-2,9.534207926698518E-2,0.12712277235598024,9891,9,5.5999999999999999E-3,7.1119999999999989E-2]
[36,25,1.524E-2,0.182,1.8200000000000001E-4,2.5335373954874889E-2,5.0670747909749778E-2,6.3338434887187225E-2,7.6006121864624673E-2,0.10134149581949956,12380,9,5.0000000000000001E-3,6.3500000000000001E-2]
[37,20.25,1.397E-2,0.153,1.5300000000000001E-4,2.0521652903448654E-2,4.1043305806897308E-2,5.1304132258621633E-2,6.1564958710345959E-2,8.2086611613794616E-2,15290,9,4.4999999999999997E-3,5.7149999999999992E-2]
[38,16,1.2449999999999999E-2,0.122,1.22E-4,1.6214639331119933E-2,3.2429278662239866E-2,4.0536598327799829E-2,4.8643917993359792E-2,6.4858557324479732E-2,19360,9,4.0000000000000001E-3,5.0799999999999998E-2]
[39,12.25,1.0919999999999999E-2,9.4E-2,9.4000000000000008E-5,1.2414333237888694E-2,2.4828666475777389E-2,3.103583309472174E-2,3.7242999713666083E-2,4.9657332951554778E-2,25270,9,3.5000000000000001E-3,4.4449999999999996E-2]
[40,9.61,9.6500000000000006E-3,7.2999999999999995E-2,7.2999999999999999E-5,9.7389177482539047E-3,1.9477835496507809E-2,2.4347294370634761E-2,2.9216753244761712E-2,3.8955670993015619E-2,31940,9,3.0999999999999999E-3,3.9369999999999995E-2]
[41,7.84,8.6400000000000001E-3,5.8999999999999997E-2,5.8999999999999998E-5,7.945173272248765E-3,1.589034654449753E-2,1.9862933180621913E-2,2.3835519816746295E-2,3.178069308899506E-2,39340,9,2.8E-3,3.5559999999999994E-2]
[42,6.25,7.62E-3,4.5999999999999999E-2,4.6E-5,6.3338434887187222E-3,1.2667686977437444E-2,1.5834608721796806E-2,1.9001530466156168E-2,2.5335373954874889E-2,49600,9,2.5000000000000001E-3,3.175E-2]
[43,4.84,6.8599999999999998E-3,3.6999999999999998E-2,3.6999999999999998E-5,4.904928397663778E-3,9.809856795327556E-3,1.2262320994159446E-2,1.4714785192991334E-2,1.9619713590655112E-2,63170,9,2.2000000000000001E-3,2.794E-2]
[44,4,6.3499999999999997E-3,3.2000000000000001E-2,3.1999999999999999E-5,4.0536598327799832E-3,8.1073196655599665E-3,1.0134149581949957E-2,1.2160979498339948E-2,1.6214639331119933E-2,76160,9,2E-3,2.5399999999999999E-2]
[45,3.1,5.4599999999999996E-3,2.3E-2,2.3E-5,3.1391541745048185E-3,6.278308349009637E-3,7.8478854362620462E-3,9.4174625235144555E-3,1.2556616698019274E-2,99110,9,1.7600000000000001E-3,2.2352E-2]
[46,2.4700000000000002,4.9800000000000001E-3,1.9E-2,1.9000000000000001E-5,2.497966530454844E-3,4.995933060909688E-3,6.24491632613711E-3,7.493899591364532E-3,9.9918661218193761E-3,123800,9,1.57E-3,1.9938999999999998E-2]
[47,1.96,4.5199999999999997E-3,1.6E-2,1.5999999999999999E-5,1.9862933180621913E-3,3.9725866361243825E-3,4.9657332951554781E-3,5.9588799541865738E-3,7.945173272248765E-3,154600,9,1.4E-3,1.7779999999999997E-2]
[48,1.54,3.9399999999999999E-3,1.2E-2,1.2E-5,1.5582268397206253E-3,3.1164536794412506E-3,3.895567099301563E-3,4.6746805191618754E-3,6.2329073588825012E-3,196600,9,1.24E-3,1.5747999999999998E-2]
[49,1.23,3.5300000000000002E-3,0.01,1.0000000000000001E-5,1.24862856999205E-3,2.4972571399841078E-3,3.1215714249801349E-3,3.7458857099761616E-3,4.9945142799682155E-3,247500,9,1.1100000000000001E-3,1.4097E-2]

{"sheet":"Surface Area","index":38,"n_rows":39,"n_cols":12,"rows_kept":39,"cut":false,"hidden":true,"merged":[]}
["Core",0,4.0000000000000001E-3,"Slope","Intercept","Design 1","Design 2","Design 3"]
[140,48.4,65.2,4200.0000000000018,48.399999999999991,48.399999999999991,156.48852459016399,48.399999999999991]
[150,76.099999999999994,120,10975.000000000002,76.099999999999994,76.099999999999994,358.54560889929758,76.099999999999994]
[180,111,150,9750,111,111,361.91978922716635,111]
[20,168,220,13000.000000000002,168,168,502.55971896955515,168,null,null,null,"Determined using slope of line by plotting 0% and 40% winding factor."]
[240,170,230,15000,170,170,556.03044496487132,170]
[270,242,290,12000,242,242,550.82435597189703,242]
[410,270,320,12500.000000000002,270,270,591.69203747072606,270]
["030",238,320,20500,238,238,765.57494145199075,238]
[280,312,440,32000.000000000004,312,312,1135.5316159250588,312]
[290,346,470,31000,346,346,1143.7962529274007,346]
["040",370,510,35000.000000000007,370,370,1270.7377049180332,370]
[130,431,604,43250.000000000007,431,431,1544.0544496487123,431]
[50,561,813,63000,561,561,2182.3278688524597,561]
[120,922,1360,109500,922,922,3740.0222482435602,922]
[380,987,1470,120750,987,987,4094.5450819672137,987]
[206,1210,1890,170000.00000000003,1210,1210,5585.0117096018757,1210]
[310,1570,2380,202500.00000000003,1570,1570,6781.411007025763,1570]
[350,1790,2630,210000,1790,1790,7194.426229508198,1790]
[930,2470,3380,227500.00000000003,2470,2470,8324.7950819672151,2470]
[548,3150,4800,412500.00000000006,3150,3150,13765.837236533962,3150]
[585,2930,5130,550000.00000000012,2930,2930,17084.44964871195,2930]
[324,3450,5510,515000.00000000006,3450,3450,16703.711943793918,3450]
[254,4840,7160,580000,4840,4840,19766.510538641691,4840]
[438,6900,9420,630000,6900,6900,23113.278688524595,6900]
["089",6170,9510,835000,6170,6170,27659.0281030445,6170]
[715,6420,10600,1045000,6420,6420,33313.454332552705,6420]
[195,9100,11500,600000,9100,9100,24541.217798594851,9100]
[109,7680,13100,1355000,7680,7680,42551.416861826707,7680]
[620,12300,16800,1125000,12300,12300,41252.283372365346,12300]
[740,18800,27100,2075000.0000000002,18800,18800,72200.878220140527,18800]
[866,11700,20300,2150000,11700,11700,67031.030444964883,11700]
[906,13000,22500,2375000,13000,13000,74121.487119437952,13000]
[102,20700,34600,3475000.0000000005,20700,20700,110130.38641686186,20700]
[337,36600,62000,6350000.0000000009,36600,36600,200019.55503512887,36600]
[165,55400,101000,11400000,55400,55400,348783.13817330217,55400]
["070",12672,23000,2582000,12672,12672,79120.707259953182,12672]
[778,19000,32000,3250000,19000,19000,102639.92974238878,19000]
[725,23310,33600,2572500.0000000005,23310,23310,89514.221311475441,23310]

{"sheet":"PN_KM_E","index":39,"n_rows":17,"n_cols":7,"rows_kept":17,"cut":false,"hidden":true,"merged":[]}
[null,null,null,"90u","60u","40u","26u"]
[null,null,"1808E","00K1808E090","00K1808E060","00K1808E040","00K1808E026"]
[null,null,"2510E","00K2510E090","00K2510E060","00K2510E040","00K2510E026"]
[null,null,"3007E","00K3007E090","00K3007E060","00K3007E040","00K3007E026"]
[null,null,"3515E","00K3515E090","00K3515E060","00K3515E040","00K3515E026"]
[null,null,"4317E","00K4317E090","00K4317E060","00K4317E040","00K4317E026"]
[null,null,"4020E","00K4020E090","00K4020E060","00K4020E040","00K4020E026"]
[null,null,"4017E","00K4017E090","00K4017E060","00K4017E040","00K4017E026"]
[null,null,"4022E","00K4022E090","00K4022E060","00K4022E040","00K4022E026"]
[null,null,"5528E",0,"00K5528E060","00K5528E040","00K5528E026"]
[null,null,"5530E",0,"00K5530E060","00K5530E040","00K5530E026"]
[null,null,"7228E",0,"00K7228E060","00K7228E040","00K7228E026"]
[null,null,"6527E",0,"00K6527E060","00K6527E040","00K6527E026"]
[null,null,"8020E",0,"00K8020E060","00K8020E040","00K8020E026"]
[null,null,"8044E",0,0,0,"00K8044E026"]
[null,null,"130LE",0,0,0,"00K130LE026"]
[null,null,"160LE",0,0,0,"00K160LE026"]

{"sheet":"Curve Fit Equations","index":40,"n_rows":91,"n_cols":7,"rows_kept":91,"cut":false,"hidden":true,"merged":[]}
["Kool Mu"]
["DC Bias","a","b","c","d","e"]
[14]
[26,1,-1.248E-3,-2.02E-5,8.3540000000000006E-8,-9.5029999999999994E-11]
[40,1,-2.7989999999999998E-3,-3.3120000000000001E-5,2.1260000000000001E-7,-3.4660000000000002E-10]
[60,1,-4.4450000000000002E-3,-8.763E-5,9.4460000000000003E-7,-2.6160000000000001E-9]
[75,1,-6.1199999999999996E-3,-1.3799999999999999E-4,1.9429999999999999E-6,-6.9560000000000004E-9]
[90,1,-9.0310000000000008E-3,-1.2180000000000001E-4,2.2539999999999999E-6,-9.2870000000000007E-9]
[125,1,-9.9179999999999997E-3,-5.0440000000000001E-4,1.2670000000000001E-5,-8.2840000000000006E-8]
["Norm Mag","a","b","c","d","e","x"]
[14]
[26,5.8680000000000001E-5,9.3620000000000002E-5,9.0110000000000006E-6,-3.6820000000000001E-4,8.7469999999999994E-6,0.5]
[40,8.8700000000000001E-5,5.592E-5,2.6999999999999999E-5,2.9280000000000002E-4,2.5740000000000001E-5,0.5]
[60,1.6579999999999999E-4,2.3010000000000002E-5,7.2970000000000001E-5,5.9059999999999998E-3,6.0529999999999998E-5,0.5]
[75,1.433E-5,9.7239999999999997E-5,1.3229999999999999E-4,7.2550000000000002E-3,1.131E-4,0.5]
[90,5.6599999999999999E-4,-1.216E-4,1.974E-4,7.2779999999999997E-3,1.6980000000000001E-4,0.5]
[125,7.8079999999999998E-5,5.0880000000000001E-4,2.5950000000000002E-4,3.9220000000000001E-3,2.285E-4,0.5]
["Core Loss","a","b","c"]
[14]
[26,120,2.09,1.46]
[40,120,2.09,1.46]
[60,193,2.0099999999999998,1.29]
[75,193,2.0099999999999998,1.29]
[90,193,2.0099999999999998,1.29]
[125,91.58,2.2000000000000002,1.63]
["MPP"]
["DC Bias","a","b","c","d","e"]
[14,0.99850000000000005,4.2569999999999999E-4,-9.611E-6,1.4909999999999999E-8,-6.2500000000000002E-12]
[26,0.99850000000000005,1.142E-3,-3.7620000000000002E-5,1.222E-7,-1.2180000000000001E-10]
[60,0.99709999999999999,2.2759999999999998E-3,-1.6229999999999999E-4,1.048E-6,-2.013E-9]
[125,0.99660000000000004,3.5969999999999999E-3,-6.5300000000000004E-4,8.8554E-6,-3.5689999999999997E-8]
[147,0.99680000000000002,4.0359999999999997E-3,-9.4620000000000001E-4,1.56E-5,-7.6599999999999998E-8]
[160,0.99729999999999996,3.4420000000000002E-3,-1.06E-3,1.897E-5,-1.004E-7]
[173,0.99870000000000003,2.5000000000000001E-3,-1.152E-3,2.2200000000000001E-5,-1.3050000000000001E-7]
[200,0.99580000000000002,5.1279999999999997E-3,-1.4989999999999999E-3,3.0549999999999997E-5,-1.85E-7]
[300,0.99419999999999997,9.4029999999999999E-3,-4.1399999999999996E-3,1.407E-4,-1.4249999999999999E-6]
[550,1.0249999999999999,-0.1462,5.6849999999999999E-3,1.7530000000000001E-4,-1.0380000000000001E-5]
["Norm Mag","a","b","c","d","e","x"]
[14,-7.5069999999999997,6.5730000000000004,0.46189999999999998,77.77,0.49869999999999998,2]
[26,6.6790000000000002E-2,1.1050000000000001E-2,-1.136E-5,1.112E-2,-1.2330000000000001E-5,2]
[60,8.1460000000000005E-2,2.3449999999999999E-2,6.0319999999999998E-5,2.4760000000000001E-2,7.1849999999999998E-5,2]
[125,6.4199999999999999E-4,-6.2710000000000001E-4,3.2529999999999999E-4,9.9010000000000001E-3,5.3660000000000003E-4,0.5]
[147,6.5300000000000004E-4,-7.3010000000000002E-4,4.5160000000000003E-4,1.583E-2,7.1849999999999995E-4,0.5]
[160,4.4700000000000002E-4,-5.5789999999999995E-4,5.2110000000000004E-4,1.0019999999999999E-2,8.164E-4,0.5]
[173,5.4500000000000002E-4,-7.716E-4,6.5059999999999998E-4,6.875E-3,1.0189999999999999E-3,0.5]
[200,1.0009999999999999E-3,-1.4499999999999999E-3,9.1270000000000001E-4,6.0569999999999999E-3,1.428E-3,0.5]
[300,9.3999999999999997E-4,-1.5430000000000001E-3,1.99E-3,2.4E-2,3.0730000000000002E-3,0.5]
[550,7.2999999999999996E-4,-1.5089999999999999E-3,6.4819999999999999E-3,6.3710000000000003E-2,9.9330000000000009E-3,0.5]
["Core Loss","a","b","c"]
[14,115.9,2.5,1.87]
[26,70.83,2.34,1.65]
[60,357.1,2.0499999999999998,1.1200000000000001]
[125,53.05,2.06,1.56]
[147,52.16,2,1.57]
[160,52.16,2,1.57]
[173,52.16,2,1.57]
[200,37.97,2.09,1.68]
[300,37.97,2.09,1.68]
[550,181,2.13,1.47]
["High Flux"]
["DC Bias","a","b","c","d","e"]
[14,1,-3.9540000000000002E-4,4.27E-7,-6.5149999999999999E-9,6.9379999999999997E-12]
[26,1,-8.0779999999999996E-5,-1.111E-5,2.344E-8,-1.392E-11]
[60,1,9.701E-4,-7.5699999999999997E-5,3.8490000000000001E-7,-5.9770000000000001E-10]
[125,1,1.236E-4,-2.2379999999999999E-4,2.0650000000000001E-6,-5.6130000000000004E-9]
[147,1,3.9760000000000002E-4,-3.5799999999999997E-4,4.1160000000000001E-6,-1.3820000000000001E-8]
[160,1,3.016E-3,-5.8969999999999997E-4,8.2279999999999998E-6,-3.5019999999999999E-8]
["Norm Mag","a","b","c","d","e","x"]
[14,-5.9450000000000003E-2,8.7030000000000007E-3,3.6230000000000002E-4,5.2900000000000003E-2,3.4739999999999999E-4,2]
[26,-4.0669999999999998E-2,1.6369999999999999E-2,3.7419999999999999E-4,5.3159999999999999E-2,3.413E-4,2]
[60,-0.16950000000000001,0.1215,1.213E-2,0.69379999999999997,1.0160000000000001E-2,2]
[125,5.3200000000000003E-4,-6.8110000000000002E-4,3.5060000000000001E-4,1.052E-2,1.694E-4,0.5]
[147,2.6699999999999998E-4,-7.829E-4,5.2899999999999996E-4,2.215E-3,2.6059999999999999E-4,0.5]
[160,2.6699999999999998E-4,-7.829E-4,5.2899999999999996E-4,2.215E-3,2.6059999999999999E-4,0.5]
["Core Loss","a","b","c"]
[14,388.8,2.31,1.54]
[26,374.9,2.21,1.49]
[60,492,2.2200000000000002,1.32]
[125,246,2.23,1.47]
[147,447.6,2.2999999999999998,1.41]
[160,447.6,2.2999999999999998,1.41]
["Xflux"]
["DC Bias","a","b","c","d","e"]
[26,1,7.5000000000000002E-4,-2.5299999999999998E-5,8.42E-8,-9.0999999999999996E-11]
[60,1,-1.1999999999999999E-3,-3.0000000000000001E-5,9.9999999999999995E-8,-1E-10]
["Norm Mag","a","b","c","d","e","x"]
[26]
[60,-0.16950000000000001,0.13150000000000001,1.2200000000000001E-2,0.74339999999999995,8.8909999999999996E-3,2]
["Core Loss","a","b","c"]
[26,665,2.0499999999999998,1.2]
[60,665,2.0499999999999998,1.2]